Package Details: lifeograph 1.4.2-1

Git Clone URL: (read-only)
Package Base: lifeograph
Description: off-line and private journal and note taking application
Upstream URL:
Keywords: note
Licenses: GNU GPL v3
Conflicts: lifeograph
Provides: lifeograph
Submitter: ksj
Maintainer: itsme
Last Packager: itsme
Votes: 9
Popularity: 0.357175
First Submitted: 2015-08-15 18:45
Last Updated: 2017-10-10 10:20

Latest Comments

nilsocket commented on 2018-01-12 17:05

I was unable to build the package, /tmp/yaourt-tmp-nil/aur-lifeograph/src/lifeograph-1.4.2/src/widget_textview.cpp:2520:5: error: 'enchant_dict_add_to_pwl' was not declared in this scope enchant_dict_add_to_pwl( m_enchant_dict, word.c_str(), word.size() ); ^~~~~~~~~~~~~~~~~~~~~~~ /tmp/yaourt-tmp-nil/aur-lifeograph/src/lifeograph-1.4.2/src/widget_textview.cpp:2520:5: note: suggested alternative: 'enchant_dict_add_to_session'

ksj commented on 2017-03-27 08:09

I don't have available any installation of archlinux now. Feel free to adopt this package.

Andenon commented on 2016-12-17 13:21

Thanks the update.

fenuks commented on 2016-05-06 22:12

@ksj Thanks!

ksj commented on 2016-05-06 08:12


fenuks commented on 2016-05-04 22:47

Please consider adding .desktop file for lifeograph for easier application launching.

ksj commented on 2016-01-26 22:09

Ok, updated.

Sandi commented on 2016-01-26 21:59

Hello! I get the following error when trying to update:

curl: (22) The requested URL returned error: 404 Not Found

Indeed, I don't think version 1.3.0.rc1 is still on launchpad. Perhaps the version number should be changed to 1.3.0? That URL seems to work.

ksj commented on 2015-12-01 09:21

thanks @jooch for solution

jooch commented on 2015-12-01 08:41

Failed to build on my system:

CMakeFiles/lifeograph.dir/build.make:62: recept voor doel 'CMakeFiles/lifeograph.dir/src/app_window.cpp.o' is mislukt
make[2]: *** [CMakeFiles/lifeograph.dir/src/app_window.cpp.o] Fout 1
CMakeFiles/Makefile2:104: recept voor doel 'CMakeFiles/lifeograph.dir/all' is mislukt
make[1]: *** [CMakeFiles/lifeograph.dir/all] Fout 2
Makefile:127: recept voor doel 'all' is mislukt
make: *** [all] Fout 2

I modified the PKGBUILD to version 1.3.0.rc1 which builds without problems.

issproevolution commented on 2015-11-19 16:20

I had tried to build lifeograph but it failed.
makepkg give me a tons of errors (like "error: ambiguous overload for 'operator='") and he exits with Error 2.
I have:
- gtkmm3 3.18.0-1
- enchant 1.6.0-5
- libgcrypt 1.6.4-1
- cmake 3.4.0-1
Furthermore, I had installed "intltool" because cmake asked it.

thanks in advance for your support!

ksj commented on 2015-09-11 05:50

kaptoxic: That's right. Updated.

kaptoxic commented on 2015-09-10 14:27

This should be added: "makedepends=(cmake)"

ksj commented on 2015-08-16 07:04

Can you tell me, why?
I'm not going to do build in section package.
Build is in section build.

Why someone needs multilib lib32-libgcrypt?
If you are in 32 or 64 bit arch, you need only libgcrypt to build.

I will add libgcrypt to dependencies.

blackdeagle commented on 2015-08-15 23:17

Replace the package() section of the PKGBUILD with

package() {
cd $pkgname-$pkgver
cmake .
make DESTDIR="$pkgdir" install

Missing dependency in depends=(): libgcrypt (and for multilib lib32-libgcrypt)