Package Details: lightspark-git test_travis.r6.gaba3311a-1

Git Clone URL: https://aur.archlinux.org/lightspark-git.git (read-only)
Package Base: lightspark-git
Description: An open source flash player implementation
Upstream URL: http://lightspark.sourceforge.net
Licenses: LGPL3
Conflicts: lightspark
Provides: lightspark
Submitter: heftig
Maintainer: Alad
Last Packager: Alad
Votes: 119
Popularity: 0.021941
First Submitted: 2010-05-18 17:00
Last Updated: 2019-08-01 13:10

Latest Comments

« First ‹ Previous 1 2 3 4 5 6 7 ... Next › Last »

iomartin commented on 2016-02-09 22:33

I had to install package glibmm:
(...)
-- Checking for module 'glibmm-2.4'
-- Package 'glibmm-2.4' not found

Kiwii commented on 2016-01-12 23:15

Had to install the package sdl_mixer or I would get "fatal error: SDL/SDL_mixer.h: No such file or directory". Maybe add that to dependencies?

respiranto commented on 2015-10-04 14:34

Worked now, thank you.

dlandau commented on 2015-10-04 11:07

Don't know what to say to you. It works here, maybe there was a broken commit and it's been fixed? As I tested now the latest revision was 3b92db0.

respiranto commented on 2015-10-02 13:46

I am getting this error upon compiling:
/home/respiranto/Downloads/AUR/lightspark-git/src/lightspark/src/scripting/abc.cpp: In static member function ‘static void lightspark::ABCVm::Run(lightspark::ABCVm*)’:
/home/respiranto/Downloads/AUR/lightspark-git/src/lightspark/src/scripting/abc.cpp:1668:20: error: expected type-specifier
th->FPM->add(new llvm::DataLayoutPass());
^

dlandau commented on 2015-08-23 18:43

Updated!

sekret commented on 2015-07-20 13:21

Built lightspark-git just now and here's my namcap output

$ namcap lightspark-git-0.7.2.r342.g3574bc3-1-x86_64.pkg.tar.xz
lightspark-git W: Referenced library 'liblightspark.so.0.7' is an uninstalled dependency
lightspark-git E: Dependency rtmpdump detected and not included (libraries ['usr/lib/librtmp.so.1'] needed in files ['usr/lib/lightspark/liblightspark.so.0.7.2'])
lightspark-git W: Dependency libsigc++ included but already satisfied

The first one is strange, but the two others should be fixed!

labelle commented on 2015-07-17 02:08

It has an additional dependency, rtmpdump!

hugoroy commented on 2014-10-22 20:14

This is now fixed https://github.com/lightspark/lightspark/commit/3d55371ee7a2524274ff3cdc546c845203ccd8ea

hugoroy commented on 2014-10-17 12:00

I can't compile it: I get this (some bits translated from French)

[ 36%] Building CXX object src/CMakeFiles/spark.dir/scripting/abc.cpp.o
/tmp/yaourt-tmp-hrd/aur-lightspark-git/src/lightspark/src/scripting/abc.cpp:49:36: fatal error: llvm/Analysis/Verifier.h : No such file or directory
#include <llvm/Analysis/Verifier.h>
^
compilation over.
src/CMakeFiles/spark.dir/build.make:928: recipe for target 'src/CMakeFiles/spark.dir/scripting/abc.cpp.o' failed
make[2]: *** [src/CMakeFiles/spark.dir/scripting/abc.cpp.o] Error 1
CMakeFiles/Makefile2:154: recipe for target 'src/CMakeFiles/spark.dir/all' failed
make[1]: *** [src/CMakeFiles/spark.dir/all] Error 2
Makefile:137: recipe for target 'all' failed
make: *** [all] Error 2