Package Details: lightspark-git test_travis.r6.gaba3311a-1

Git Clone URL: https://aur.archlinux.org/lightspark-git.git (read-only)
Package Base: lightspark-git
Description: An open source flash player implementation
Upstream URL: http://lightspark.sourceforge.net
Licenses: LGPL3
Conflicts: lightspark
Provides: lightspark
Submitter: heftig
Maintainer: Alad
Last Packager: Alad
Votes: 119
Popularity: 0.021502
First Submitted: 2010-05-18 17:00
Last Updated: 2019-08-01 13:10

Latest Comments

« First ‹ Previous 1 2 3 4 5 6 7 8 ... Next › Last »

sekret commented on 2014-09-24 07:44

Disowned, please treat it with care :)

sekret commented on 2014-09-21 06:46

Confirmed! But this has to go upstream! Wanna report it there?

neng commented on 2014-09-20 23:03

aur-lightspark-git/src/lightspark/src/scripting/abc.cpp:49:36: fatal error: llvm/Analysis/Verifier.h: No such file or directory

compilation terminated.
src/CMakeFiles/spark.dir/build.make:928: recipe for target 'src/CMakeFiles/spark.dir/scripting/abc.cpp.o' failed
make[2]: *** [src/CMakeFiles/spark.dir/scripting/abc.cpp.o] Error 1
CMakeFiles/Makefile2:154: recipe for target 'src/CMakeFiles/spark.dir/all' failed
make[1]: *** [src/CMakeFiles/spark.dir/all] Error 2
Makefile:137: recipe for target 'all' failed
make: *** [all] Error 2

sekret commented on 2014-07-30 22:52

Adopted and updated. Please give word for anything missing. Strangely the browser plugin builds even without xulrunner. I built it in a chroot environment to be sure.

FredBezies commented on 2014-05-18 09:31

You should try this PKGBUILD, far cleaner and working : http://pastebin.com/qk1zqCxg

apaugh commented on 2013-11-11 21:52

Is anyone else getting this error? The build seems to have a problem with my version of freetype. Could this be an x64 issue? I haven't been able to figure it out. I tried an older snapshot of the repo (fff7e63) and I have the same issue.

Linking CXX shared library ../x86_64/Release/lib/liblightspark.so
/usr/lib64/i386-linux-gnu/libfreetype.so: could not read symbols: File in wrong format
collect2: error: ld returned 1 exit status
src/CMakeFiles/spark.dir/build.make:2709: recipe for target 'x86_64/Release/lib/liblightspark.so.0.7.2' failed
make[2]: *** [x86_64/Release/lib/liblightspark.so.0.7.2] Error 1
CMakeFiles/Makefile2:157: recipe for target 'src/CMakeFiles/spark.dir/all' failed
make[1]: *** [src/CMakeFiles/spark.dir/all] Error 2
Makefile:136: recipe for target 'all' failed
make: *** [all] Error 2

cpatrick08 commented on 2013-08-21 22:53

might have gotten the errer from migrating to parabola from arch. reinstalled with parabola iso and don't have the problem anymore

mmm commented on 2013-08-21 20:59

hmm..just tested and I cant confirm your troubles, builds fine here (x86_64). Are you using updated versions for all progs?
btw, you can test: download the PKGBUILD from this site, install all dependencies and run makepkg. also, does it create a dir, what is its name?

cpatrick08 commented on 2013-08-21 19:57

get following error message when I run makepkg ==> Making package: lightspark-git 20130215-2 (Wed Aug 21 14:56:48 CDT 2013)
==> Checking runtime dependencies...
==> Checking buildtime dependencies...
==> Retrieving sources...
-> Cloning lightspark git repo...
==> Validating source files with md5sums...
lightspark ... Skipped
==> Extracting sources...
-> Creating working copy of lightspark git repo...
/usr/bin/makepkg: line 1387: cd: lightspark: No such file or directory
==> ERROR: Failed to change to directory lightspark
Aborting...
here is my /usr/bin/makepkg http://pastebin.com/FerS56up

dlh commented on 2013-08-13 15:36

I have the same issue as @the-kyle