Package Details: linuxsampler-svn r3751-1

Git Clone URL: https://aur.archlinux.org/linuxsampler-svn.git (read-only, click to copy)
Package Base: linuxsampler-svn
Description: Sampler backend, including sampler engine, audio and MIDI drivers, network layer (LSCP) API and native C++ API
Upstream URL: http://www.linuxsampler.org/
Licenses: GPL, custom
Conflicts: linuxsampler
Provides: linuxsampler
Submitter: None
Maintainer: reesewang
Last Packager: reesewang
Votes: 29
Popularity: 0.070961
First Submitted: 2011-08-24 00:46
Last Updated: 2020-03-03 14:08

Latest Comments

« First ‹ Previous 1 2 3 4 5 Next › Last »

cocreature commented on 2014-03-22 22:56

I just tried it compiles fine here on my local system. Also your compiler output seems to start after the actual error occured so I can't help you withouth you showing me the actual error.

Anonymous comment on 2014-03-22 22:43

Error here :

compilation terminated.
Makefile:433: recipe for target 'lscp_shell_reference.lo' failed
make[3]: *** [lscp_shell_reference.lo] Error 1
make[3]: Leaving directory '/home/earn/AUR/linuxsampler-svn/src/linuxsampler-svn/src/network'
Makefile:655: recipe for target 'all-recursive' failed
make[2]: *** [all-recursive] Error 1
make[2]: Leaving directory '/home/earn/AUR/linuxsampler-svn/src/linuxsampler-svn/src'
Makefile:493: recipe for target 'all-recursive' failed
make[1]: *** [all-recursive] Error 1
make[1]: Leaving directory '/home/earn/AUR/linuxsampler-svn/src/linuxsampler-svn'
Makefile:397: recipe for target 'all' failed
make: *** [all] Error 2
==> ERREUR : Une erreur s’est produite dans build().

Anonymous comment on 2014-03-22 22:41

I've got an error here :

Makefile:433: recipe for target 'lscp_shell_reference.lo' failed
make[3]: *** [lscp_shell_reference.lo] Error 1
make[3]: Leaving directory '/home/arnaud/AUR/linuxsampler-svn/src/linuxsampler-svn/src/network'
Makefile:655: recipe for target 'all-recursive' failed
make[2]: *** [all-recursive] Error 1
make[2]: Leaving directory '/home/arnaud/AUR/linuxsampler-svn/src/linuxsampler-svn/src'
Makefile:493: recipe for target 'all-recursive' failed
make[1]: *** [all-recursive] Error 1
make[1]: Leaving directory '/home/arnaud/AUR/linuxsampler-svn/src/linuxsampler-svn'
Makefile:397: recipe for target 'all' failed
make: *** [all] Error 2

cocreature commented on 2013-12-31 08:45

I'm now the maintainer of linuxsampler-svn. If you have any problem feel free to drop a comment. Also you have to rebuild it manually this time as the way pkgversions are calculated has changed and so for example yaourt won't recognize the update.

cocreature commented on 2013-12-15 10:14

I created a pkgbuild which just uses the pkgver function and fetches the latest revision instead of fetching the one specified in the pkgver. https://gist.github.com/Javafant/7971128

jlu85 commented on 2013-10-10 10:33

Changing pkgver=2473 builds ok with bison 3.

svictor commented on 2013-08-25 14:28

Building with bison 3.0.1 fixed in rev2461. Please upgrade the package.

svictor commented on 2013-08-06 22:35

Downgrading bison to 2.7.12 it builds ok. Sorry, I don't have the knowledge to fix the code itself.

svictor commented on 2013-08-03 22:56

Build fails. Not sure why...

lscp.y:472:24: note: in expansion of macro 'LSCPSERVER'
load_instr_args : filename SP instrument_index SP sampler_channel { $$ = LSCPSERVER->LoadInstrument($1, $3, $5); }
^
lscp.y:42:40: error: 'yyparse_param' was not declared in this scope
#define LSCPSERVER ((yyparse_param_t*) yyparse_param)->pServer
^
lscp.y:473:24: note: in expansion of macro 'LSCPSERVER'
| NON_MODAL SP filename SP instrument_index SP sampler_channel { $$ = LSCPSERVER->LoadInstrument($3, $5, $7, true); }
^
lscp.y:42:40: error: 'yyparse_param' was not declared in this scope
#define LSCPSERVER ((yyparse_param_t*) yyparse_param)->pServer
^
lscp.y:476:24: note: in expansion of macro 'LSCPSERVER'
load_engine_args : engine_name SP sampler_channel { $$ = LSCPSERVER->SetEngineType($1, $3); }
^
make[3]: *** [lscpparser.lo] Error 1
make[3]: Leaving directory `/home/victor/bin/linuxsampler-svn/src/linuxsampler-build/src/network'
make[2]: *** [all-recursive] Error 1
make[2]: Leaving directory `/home/victor/bin/linuxsampler-svn/src/linuxsampler-build/src'
make[1]: *** [all-recursive] Error 1
make[1]: Leaving directory `/home/victor/bin/linuxsampler-svn/src/linuxsampler-build'
make: *** [all] Error 2

Nareto commented on 2013-07-06 15:47

please add "bison" as build dependency. It won't compile without yacc (which is in bison)