Package Details: lkrg-dkms 0.9.1-1

Git Clone URL: https://aur.archlinux.org/lkrg-dkms.git (read-only, click to copy)
Package Base: lkrg-dkms
Description: Linux Kernel Runtime Guard (DKMS)
Upstream URL: https://www.openwall.com/lkrg/
Licenses: GPL2
Submitter: rgacogne
Maintainer: rgacogne
Last Packager: rgacogne
Votes: 2
Popularity: 0.49
First Submitted: 2020-03-16 16:39
Last Updated: 2021-04-28 07:37

Latest Comments

rgacogne commented on 2021-03-22 08:35

Thank you for reporting the issue! Unfortunately there has not been any release recently and I can't keep backporting more and more patches as they simply don't apply anymore. I will reach out to upstream to ask if a new version could be released. In the meantime I just pushed lkrg-dkms-git which uses the latest git commit.

yekm commented on 2021-03-22 08:25

# tail -n 20 /var/lib/dkms/lkrg/0.8.1/build/make.log
  CC [M]  /var/lib/dkms/lkrg/0.8.1/build/src/modules/exploit_detection/syscalls/p_capable/p_capable.o
  CC [M]  /var/lib/dkms/lkrg/0.8.1/build/src/modules/exploit_detection/syscalls/p_scm_send/p_scm_send.o
  CC [M]  /var/lib/dkms/lkrg/0.8.1/build/src/modules/exploit_detection/p_exploit_detection.o
  CC [M]  /var/lib/dkms/lkrg/0.8.1/build/src/p_lkrg_main.o
/var/lib/dkms/lkrg/0.8.1/build/src/modules/exploit_detection/p_exploit_detection.c: In function ‘p_dump_seccomp’:
/var/lib/dkms/lkrg/0.8.1/build/src/modules/exploit_detection/p_exploit_detection.c:505:36: error: ‘TIF_SECCOMP’ undeclared (first use in this function); did you mean ‘SYS_SECCOMP’?
  505 |    if (test_tsk_thread_flag(p_task,TIF_SECCOMP))
      |                                    ^~~~~~~~~~~
      |                                    SYS_SECCOMP
/var/lib/dkms/lkrg/0.8.1/build/src/modules/exploit_detection/p_exploit_detection.c:505:36: note: each undeclared identifier is reported only once for each function it appears in
/var/lib/dkms/lkrg/0.8.1/build/src/modules/exploit_detection/p_exploit_detection.c: In function ‘p_cmp_tasks’:
/var/lib/dkms/lkrg/0.8.1/build/src/modules/exploit_detection/p_exploit_detection.c:1187:42: error: ‘TIF_SECCOMP’ undeclared (first use in this function); did you mean ‘SYS_SECCOMP’?
 1187 |       if (test_tsk_thread_flag(p_current,TIF_SECCOMP) != p_orig->p_ed_task.p_sec.flag) {
      |                                          ^~~~~~~~~~~
      |                                          SYS_SECCOMP
make[2]: *** [scripts/Makefile.build:279: /var/lib/dkms/lkrg/0.8.1/build/src/modules/exploit_detection/p_exploit_detection.o] Error 1
make[2]: *** Waiting for unfinished jobs....
make[1]: *** [Makefile:1806: /var/lib/dkms/lkrg/0.8.1/build] Error 2
make[1]: Leaving directory '/usr/lib/modules/5.11.8-arch1-1/build'
make: *** [Makefile:98: all] Error 2