Package Details: llpp-git 31.r24.gc79a0b8-1

Git Clone URL: https://aur.archlinux.org/llpp-git.git (read-only, click to copy)
Package Base: llpp-git
Description: A graphical PDF viewer which aims to superficially resemble less(1).
Upstream URL: http://repo.or.cz/w/llpp.git
Licenses: custom
Conflicts: llpp
Provides: llpp
Submitter: mfwitten
Maintainer: aksr
Last Packager: aksr
Votes: 61
Popularity: 0.78
First Submitted: 2010-10-26 22:21
Last Updated: 2020-03-18 06:05

Dependencies (37)

Required by (0)

Sources (1)

Latest Comments

« First ‹ Previous 1 2 3 4 5 6 7 8 ... Next › Last »

tutu commented on 2015-10-30 03:19

Hi there - I notice that this package was recently updated and the installation was "successful". However, when I try to use the llpp I get the following error.

$ llpp
No bytecode file specified.

Did I miss something?
I checked for the required dependencies and it seems I have them all.

The command I use to install it was:

$ git clone https://aur.archlinux.org/llpp-git.git
$ cd llpp-git
$ makepkg -sri

Thanks for the help.

PS: I really like this program. Have any of you guys able to make the forward or inverse search work with the highlight rectangle? I've seen this feature in SumatraPDF and it seems it is also present on llpp, but I was not able to make it work.

holos commented on 2015-09-28 15:54

Upstream has traded ninja for some Haskell-based build system. All this build system juggling is making maintaining this package very annoying.

rubenvb commented on 2015-04-28 08:46

I cannot build this due to the following makepkg errors:

==> Building and installing package
==> Making package: llpp-git 21.r61.gdf146ab-1 (Tue Apr 28 10:45:52 CEST 2015)
==> Checking runtime dependencies...
==> Checking buildtime dependencies...
==> Retrieving sources...
-> Cloning llpp git repo...
Cloning into bare repository '/tmp-yaourt/yaourt-tmp-ruben/aur-llpp-git/llpp'...
remote: Counting objects: 6294, done.
remote: Compressing objects: 100% (1999/1999), done.
remote: Total 6294 (delta 4277), reused 6291 (delta 4276)
Receiving objects: 100% (6294/6294), 1.49 MiB | 0 bytes/s, done.
Resolving deltas: 100% (4277/4277), done.
Checking connectivity... done.
-> Found fix-libs.patch
==> Validating source files with sha256sums...
llpp ... Skipped
fix-libs.patch ... Passed
==> Extracting sources...
-> Creating working copy of llpp git repo...
Cloning into 'llpp'...
done.
==> Starting pkgver()...
==> Updated version: llpp-git 21.r63.g6686874-1
==> Starting prepare()...
patching file build.ninja
patching file configure.sh
==> Starting build()...
Configuration results are saved in /tmp-yaourt/yaourt-tmp-ruben/aur-llpp-git/src/llpp/.config
To build - type: ninja
[11/11] link /tmp-yaourt/yaourt-tmp-ruben/aur-llpp-git/src/llpp/build/llpp.custom
make: Entering directory '/tmp-yaourt/yaourt-tmp-ruben/aur-llpp-git/src/llpp/misc/completions'
wrote: bash/llpp
wrote: zsh/llpp
wrote: bash/llppac
wrote: zsh/llppac
make: Leaving directory '/tmp-yaourt/yaourt-tmp-ruben/aur-llpp-git/src/llpp/misc/completions'
==> Entering fakeroot environment...
==> Starting package()...
make: Entering directory '/tmp-yaourt/yaourt-tmp-ruben/aur-llpp-git/src/llpp/misc/completions'
install -d /tmp-yaourt/yaourt-tmp-ruben/aur-llpp-git/pkg/llpp-git/usr/share/bash-completion/completions
install -m644 bash/{llpp,llppac} \
/tmp-yaourt/yaourt-tmp-ruben/aur-llpp-git/pkg/llpp-git/usr/share/bash-completion/completions
install: cannot stat 'bash/{llpp,llppac}': No such file or directory
Makefile:15: recipe for target 'install' failed
make: *** [install] Error 1
make: Leaving directory '/tmp-yaourt/yaourt-tmp-ruben/aur-llpp-git/src/llpp/misc/completions'
==> ERROR: A failure occurred in package().
Aborting...
==> ERROR: Makepkg was unable to build llpp-git.

flu commented on 2015-04-22 10:49

It's failing here:

==> Starting build()...
configure.sh:cd:46: string not in pwd: build
==> ERROR: A failure occurred in build().
Aborting...

CjK commented on 2015-01-25 22:29

Same error for me, after building with makepkg or pacaur:

$ llpp my.pdf
llpp: error while loading shared libraries: /home/cjk/abs/local/llpp-git/src/llpp/build/link.so: cannot open shared object file: No such file or directory

windowsrefund commented on 2015-01-08 22:32

Attempted to run llpp after a recent yaourt install...

llpp: error while loading shared libraries: /tmp/yaourt-tmp-windowsrefund/aur-llpp-git/src/llpp/build/link.so: cannot open shared object file: No such file or directory

holos commented on 2014-11-24 16:46

Should work now.

holos commented on 2014-09-03 17:52

A current PKGBUILD: http://sprunge.us/LUSI

The install file should be one for updating the desktop file database

llpp switched to ocaml 4.02, so this will not work until you have the new ocaml.

karol_007 commented on 2014-09-02 00:22

==> Updated version: llpp-git 1757.bb1ce65-1
==> Starting build()...
==> Cleaning ...
==> Compiling ...
sh: buildall.sh: No such file or directory
==> ERROR: A failure occurred in build().
Aborting...

flu commented on 2014-08-17 17:25

llppac is not found. I found it in a another location:

install misc/llppac "$pkgdir"/usr/bin/llppac
^^^^^