Package Details: llvm-ocaml38 3.8.1-4

Git Clone URL: https://aur.archlinux.org/llvm38.git (read-only)
Package Base: llvm38
Description: OCaml bindings for LLVM
Upstream URL: http://llvm.org/
Licenses: custom:University of Illinois/NCSA Open Source License
Conflicts: llvm-ocaml
Provides: llvm-ocaml=3.8.1-4
Replaces: llvm-ocaml
Submitter: ftschindler
Maintainer: ftschindler
Last Packager: ftschindler
Votes: 0
Popularity: 0.000000
First Submitted: 2017-05-22 14:22
Last Updated: 2017-11-05 21:33

Latest Comments

ftschindler commented on 2017-10-09 20:27

Done, thx for reporting.

zombien-5 commented on 2017-10-09 08:57

pls change http://llvm.org/releases/ to http://releases.llvm.org/

ftschindler commented on 2017-07-14 10:33

Thank you for reporting. I could reproduce the error and added a fix.

seu commented on 2017-07-12 17:32

Fails to compile:
[ 90%] Building CXX object tools/lldb/source/Utility/CMakeFiles/lldbUtility.dir/TaskPool.cpp.o
In file included from /tmp/yaourt-tmp-seu/aur-llvm38/src/llvm-3.8.1.src/tools/lldb/source/Utility/TaskPool.cpp:10:0:
/tmp/yaourt-tmp-seu/aur-llvm38/src/llvm-3.8.1.src/tools/lldb/include/lldb/Utility/TaskPool.h: In static member function ‘static std::future<typename std::result_of<_Functor(_ArgTypes ...)>::type> TaskPool::AddTask(F&&, Args&& ...)’:
/tmp/yaourt-tmp-seu/aur-llvm38/src/llvm-3.8.1.src/tools/lldb/include/lldb/Utility/TaskPool.h:110:14: error: ‘bind’ is not a member of ‘std’
std::bind(std::forward<F>(f), std::forward<Args>(args)...));
^~~~
/tmp/yaourt-tmp-seu/aur-llvm38/src/llvm-3.8.1.src/tools/lldb/include/lldb/Utility/TaskPool.h:110:14: note: suggested alternative: ‘end’
std::bind(std::forward<F>(f), std::forward<Args>(args)...));
^~~~
end
At global scope:
cc1plus: warning: unrecognized command line option ‘-Wno-vla-extension’
cc1plus: warning: unrecognized command line option ‘-Wno-deprecated-register’
make[2]: *** [tools/lldb/source/Utility/CMakeFiles/lldbUtility.dir/build.make:423: tools/lldb/source/Utility/CMakeFiles/lldbUtility.dir/TaskPool.cpp.o] Error 1
make[1]: *** [CMakeFiles/Makefile2:35299: tools/lldb/source/Utility/CMakeFiles/lldbUtility.dir/all] Error 2
make: *** [Makefile:152: all] Error 2