Package Details: llvm38 3.8.1-5

Git Clone URL: (read-only, click to copy)
Package Base: llvm38
Description: Low Level Virtual Machine
Upstream URL:
Licenses: custom:University of Illinois/NCSA Open Source License
Conflicts: llvm
Provides: llvm=3.8.1-5
Replaces: llvm
Submitter: ftschindler
Maintainer: None
Last Packager: kwantam
Votes: 0
Popularity: 0.000000
First Submitted: 2017-05-22 14:22
Last Updated: 2018-10-01 01:09

Dependencies (12)

Required by (265)

Sources (18)

Latest Comments

kwantam commented on 2019-03-28 22:25

As far as I can tell it's a perfectly valid key. Probably you don't have it available locally.

gpg --recv-keys 11E521D646982372EB577A1F8F0871F202119294

or something similar should work.

radrow commented on 2019-03-27 13:13

GPG key is invalid: 8F0871F202119294

kwantam commented on 2018-10-01 01:13

Thanks for reporting. I've just pushed a fix that addresses this issue.

However, since I don't need this package any more, and because I anticipate it will continue breaking as it gets more and more out of date, I'm going to give up ownership of it.

nicholascw commented on 2018-09-30 17:39

Cannot compile, with error: /tmp/llvm38/src/llvm-3.8.1.src/include/llvm/IR/ValueMap.h:102:31: error:cannot convert ‘const std::unique_ptr<llvm::densemap<const llvm::metadata*,="" llvm::trackingmdref=""> >’ to ‘bool’ in return</llvm::densemap<const>

ftschindler commented on 2018-02-14 21:28

Thx for reporting. However, I do not require the package any more. Feel free to pick it up and submit a fix!

Prism019 commented on 2018-02-09 08:45

Fails to resolve dependencies as ocaml has updated to 4.06.0-1

ftschindler commented on 2017-10-09 20:27

Done, thx for reporting.

zombien-5 commented on 2017-10-09 08:57

pls change to

ftschindler commented on 2017-07-14 10:33

Thank you for reporting. I could reproduce the error and added a fix.

seu commented on 2017-07-12 17:32

Fails to compile:
[ 90%] Building CXX object tools/lldb/source/Utility/CMakeFiles/lldbUtility.dir/TaskPool.cpp.o
In file included from /tmp/yaourt-tmp-seu/aur-llvm38/src/llvm-3.8.1.src/tools/lldb/source/Utility/TaskPool.cpp:10:0:
/tmp/yaourt-tmp-seu/aur-llvm38/src/llvm-3.8.1.src/tools/lldb/include/lldb/Utility/TaskPool.h: In static member function ‘static std::future<typename std::result_of<_Functor(_ArgTypes ...)>::type> TaskPool::AddTask(F&&, Args&& ...)’:
/tmp/yaourt-tmp-seu/aur-llvm38/src/llvm-3.8.1.src/tools/lldb/include/lldb/Utility/TaskPool.h:110:14: error: ‘bind’ is not a member of ‘std’
std::bind(std::forward<F>(f), std::forward<Args>(args)...));
/tmp/yaourt-tmp-seu/aur-llvm38/src/llvm-3.8.1.src/tools/lldb/include/lldb/Utility/TaskPool.h:110:14: note: suggested alternative: ‘end’
std::bind(std::forward<F>(f), std::forward<Args>(args)...));
At global scope:
cc1plus: warning: unrecognized command line option ‘-Wno-vla-extension’
cc1plus: warning: unrecognized command line option ‘-Wno-deprecated-register’
make[2]: *** [tools/lldb/source/Utility/CMakeFiles/lldbUtility.dir/build.make:423: tools/lldb/source/Utility/CMakeFiles/lldbUtility.dir/TaskPool.cpp.o] Error 1
make[1]: *** [CMakeFiles/Makefile2:35299: tools/lldb/source/Utility/CMakeFiles/lldbUtility.dir/all] Error 2
make: *** [Makefile:152: all] Error 2