Package Details: llvm39-libs 3.9.1-5

Git Clone URL: https://aur.archlinux.org/llvm39.git (read-only)
Package Base: llvm39
Description: Low Level Virtual Machine (runtime libraries, 3.9.x)
Upstream URL: http://llvm.org/
Licenses: custom:University of Illinois/NCSA Open Source License
Conflicts: llvm-libs
Provides: llvm-libs=3.9.1-5
Submitter: foutrelis
Maintainer: ftschindler
Last Packager: ftschindler
Votes: 0
Popularity: 0.000000
First Submitted: 2018-02-07 17:03
Last Updated: 2018-08-04 21:27

Required by (32)

Sources (8)

Latest Comments

ftschindler commented on 2018-08-04 21:29

I could not solve the problem and have thus disabled the failing test. This is of course not optimal and I am open to suggestions.

ftschindler commented on 2018-08-04 07:10

I can reproduce the issue. I will try to investigate, input welcome!

alfredo.ardito commented on 2018-08-03 16:00

Hello i rebuilt the package in clean chroots and it failed reporting this error:

[100%] Running the LLVM regression tests -- Testing: 17222 tests, 4 threads -- Testing: FAIL: LLVM-Unit :: ADT/ADTTests/ArrayRefTest.InitializerList (95 of 17222) **** TEST 'LLVM-Unit :: ADT/ADTTests/ArrayRefTest.InitializerList' FAILED ****** Note: Google Test filter = ArrayRefTest.InitializerList [==========] Running 1 test from 1 test case. [----------] Global test environment set-up. [----------] 1 test from ArrayRefTest [ RUN ] ArrayRefTest.InitializerList /build/llvm39/src/llvm-3.9.1.src/unittests/ADT/ArrayRefTest.cpp:139: Failure Value of: A[i] Actual: 0 Expected: i Which is: 1 /build/llvm39/src/llvm-3.9.1.src/unittests/ADT/ArrayRefTest.cpp:139: Failure Value of: A[i] Actual: 1175747072 Expected: i Which is: 2 /build/llvm39/src/llvm-3.9.1.src/unittests/ADT/ArrayRefTest.cpp:139: Failure Value of: A[i] Actual: 22097 Expected: i Which is: 3 /build/llvm39/src/llvm-3.9.1.src/unittests/ADT/ArrayRefTest.cpp:139: Failure Value of: A[i] Actual: 1175522016 Expected: i Which is: 4 [ FAILED ] ArrayRefTest.InitializerList (1 ms) [----------] 1 test from ArrayRefTest (1 ms total)

[----------] Global test environment tear-down [==========] 1 test from 1 test case ran. (1 ms total) [ PASSED ] 0 tests. [ FAILED ] 1 test, listed below: [ FAILED ] ArrayRefTest.InitializerList

1 FAILED TEST


Testing: 0 .. 10.. 20.. 30.. 40.. 50.. 60.. 70.. 80.. 90.. Testing Time: 189.38s


Failing Tests (1): LLVM-Unit :: ADT/ADTTests/ArrayRefTest.InitializerList

Expected Passes : 16758 Expected Failures : 124 Unsupported Tests : 339 Unexpected Failures: 1 make[3]: [test/CMakeFiles/check-llvm.dir/build.make:58: test/CMakeFiles/check-llvm] Error 1 make[2]: [CMakeFiles/Makefile2:69058: test/CMakeFiles/check-llvm.dir/all] Error 2 make[1]: [CMakeFiles/Makefile2:69065: test/CMakeFiles/check-llvm.dir/rule] Error 2 make: [Makefile:15552: check-llvm] Error 2 ==> ERROR: A failure occurred in check(). Aborting...

alfredo.ardito commented on 2018-08-03 13:01

got this error when building Scanning dependencies of target check-llvm [100%] Running the LLVM regression tests FAIL: LLVM-Unit :: ADT/ADTTests/ArrayRefTest.InitializerList (93 of 17358) **** TEST 'LLVM-Unit :: ADT/ADTTests/ArrayRefTest.InitializerList' FAILED ****** Note: Google Test filter = ArrayRefTest.InitializerList [==========] Running 1 test from 1 test case. [----------] Global test environment set-up. [----------] 1 test from ArrayRefTest [ RUN ] ArrayRefTest.InitializerList /home/xxxxxxxxx/.cache/aurman/llvm39/src/llvm-3.9.1.src/unittests/ADT/ArrayRefTest.cpp:139: Failure Value of: A[i] Actual: 0 Expected: i Which is: 1 /home/xxxxxxxxxxx/.cache/aurman/llvm39/src/llvm-3.9.1.src/unittests/ADT/ArrayRefTest.cpp:139: Failure Value of: A[i] Actual: 1483131408 Expected: i Which is: 2 /home/xxxxxxxxxxx/.cache/aurman/llvm39/src/llvm-3.9.1.src/unittests/ADT/ArrayRefTest.cpp:139: Failure Value of: A[i] Actual: 22006 Expected: i Which is: 3 /home/xxxxxxxxxxx/.cache/aurman/llvm39/src/llvm-3.9.1.src/unittests/ADT/ArrayRefTest.cpp:139: Failure Value of: A[i] Actual: 1482906304 Expected: i Which is: 4 [ FAILED ] ArrayRefTest.InitializerList (0 ms) [----------] 1 test from ArrayRefTest (0 ms total)

[----------] Global test environment tear-down [==========] 1 test from 1 test case ran. (0 ms total) [ PASSED ] 0 tests. [ FAILED ] 1 test, listed below: [ FAILED ] ArrayRefTest.InitializerList

1 FAILED TEST


Testing Time: 175.59s


Failing Tests (1): LLVM-Unit :: ADT/ADTTests/ArrayRefTest.InitializerList

Expected Passes : 16895 Expected Failures : 124 Unsupported Tests : 338 Unexpected Failures: 1 make[3]: [test/CMakeFiles/check-llvm.dir/build.make:58: test/CMakeFiles/check-llvm] Error 1 make[2]: [CMakeFiles/Makefile2:69302: test/CMakeFiles/check-llvm.dir/all] Error 2 make[1]: [CMakeFiles/Makefile2:69309: test/CMakeFiles/check-llvm.dir/rule] Error 2 make: [Makefile:15565: check-llvm] Error 2 ==> ERROR: A failure occurred in check(). Aborting...

Any Clue?