Package Details: lomoco 1.0-12

Git Clone URL: https://aur.archlinux.org/lomoco.git (read-only, click to copy)
Package Base: lomoco
Description: Logitech USB mouse configuration program
Upstream URL: https://launchpad.net/ubuntu/+source/lomoco
Licenses: GPL
Replaces: lmctl
Submitter: Barthalion
Maintainer: SammysHP
Last Packager: SammysHP
Votes: 4
Popularity: 0.000028
First Submitted: 2018-01-06 20:58
Last Updated: 2019-12-20 10:58

Latest Comments

dreieck commented on 2019-12-17 12:04

Fails to build for me:

[...]
gcc -DHAVE_CONFIG_H -I. -I..    -Wall -g0 -march=x86-64 -mtune=native -O3 -pipe -fstack-protector --param=ssp-buffer-size=4 -D_FORTIFY_SOURCE=2 -fomit-frame-pointer -fPIC -MT cmdline.o -MD -MP -MF .deps/cmdline.Tpo -c -o cmdline.o cmdline.c
In file included from cmdline.h:35,
                 from lomoco.c:25:
lomoco.h:32:10: fatal error: stropts.h: No such file or directory
   32 | #include <stropts.h>
      |          ^~~~~~~~~~~
compilation terminated.
make[2]: *** [Makefile:398: lomoco.o] Error 1
make[2]: *** Waiting for unfinished jobs....
In file included from cmdline.h:35,
                 from cmdline.c:24:
lomoco.h:32:10: fatal error: stropts.h: No such file or directory
   32 | #include <stropts.h>
      |          ^~~~~~~~~~~
compilation terminated.
make[2]: *** [Makefile:398: cmdline.o] Error 1
make[2]: Leaving directory '/tmp/yaourt-tmp-felics/aur-lomoco/src/lomoco-1.0/src'
make[1]: *** [Makefile:364: all-recursive] Error 1
make[1]: Leaving directory '/tmp/yaourt-tmp-felics/aur-lomoco/src/lomoco-1.0'
make: *** [Makefile:305: all] Error 2
==> ERROR: A failure occurred in build().
    Aborting...

SammysHP commented on 2019-04-08 18:00

@skrooms

Works fine for me if using root permissions (which is required for lomoco).

skrooms commented on 2019-04-07 18:28

Attempting to use this results in a segmentation fault.

SammysHP commented on 2018-01-07 14:17

Adopted this package as I use it sometimes. Development stopped 10 years ago, but it is useful e.g. to enable all buttons on a MX518.