Package Details: lttng-ust 2.9.0-1

Git Clone URL: https://aur.archlinux.org/lttng-ust.git (read-only)
Package Base: lttng-ust
Description: LTTng user space tracing libraries for LTTng
Upstream URL: http://lttng.org/
Licenses: GPL2, MIT, LGPL2.1
Submitter: christoph.gysin
Maintainer: christoph.gysin (eepp)
Last Packager: eepp
Votes: 41
Popularity: 2.700544
First Submitted: 2015-08-27 06:13
Last Updated: 2016-12-02 04:48

Latest Comments

fmillion commented on 2017-05-21 17:36

Builds fine on my older Atom 330 machine.

Trying to build in a VM on my i7-6700K fails.

Both have a fresh base-devel install and all dependencies required by the package.

Log where it fails:

CC lttng-ust-statedump.lo
lttng-ust-statedump.c:447:36: warning: 'struct dl_phdr_info' declared inside par
ameter list will not be visible outside of this definition or declaration
int extract_bin_info_events(struct dl_phdr_info *info, size_t size, void *_data)
^~~~~~~~~~~~
lttng-ust-statedump.c: In function 'extract_bin_info_events':
lttng-ust-statedump.c:460:22: error: dereferencing pointer to incomplete type 'struct dl_phdr_info'
for (j = 0; j < info->dlpi_phnum; j++) {
^~
lttng-ust-statedump.c: In function 'lttng_ust_dl_update':
lttng-ust-statedump.c:571:2: warning: implicit declaration of function 'dl_iterate_phdr' [-Wimplicit-function-declaration]
dl_iterate_phdr(extract_bin_info_events, &data);
^~~~~~~~~~~~~~~
make[2]: *** [Makefile:641: lttng-ust-statedump.lo] Error 1
make[2]: *** Waiting for unfinished jobs....
make[2]: Leaving directory '/home/build/lttng-ust/src/lttng-ust-2.9.0/liblttng-ust'
make[1]: *** [Makefile:565: all-recursive] Error 1
make[1]: Leaving directory '/home/build/lttng-ust/src/lttng-ust-2.9.0'
make: *** [Makefile:440: all] Error 2

khouli commented on 2017-03-31 19:28

Failing (2.9.0-1) with:

configure: error: LTTng-UST requires shared libraries to be enabled

I'm not sure how to solve.

varg commented on 2016-11-14 20:59

Failing (version 2.8.1) with:

/doc/examples/gen-tp/sample.c:26:31: fatal error: sample_tracepoint.h: No such file or directory

Solved by adding:

export BUILD_GEN_TP_EXAMPLES=false

at the top of the build() function in PKGBUILD.

Scimmia commented on 2016-09-28 17:51

Install file doesn't do anything here, ldconfig is already run by pacman and has been forever.

christoph.gysin commented on 2016-04-22 20:21

Can't reproduce, seems to build fine for me.

hpstg commented on 2016-04-22 17:28

[ 5%] Built target coreclrpal
[ 5%] Linking CXX static library libeventprovider.a
[ 5%] Built target eventprovider
[ 5%] Linking CXX shared library libcoreclrtraceptprovider.so
[ 5%] Built target coreclrtraceptprovider
Makefile:127: recipe for target 'all' failed
make: *** [all] Error 2
Failed to build coreclr components.
==> ERROR: A failure occurred in build().
Aborting...
==> ERROR: Makepkg was unable to build coreclr-git.


This is what I get when I try to build it.