Package Details: lutris-git 0.5.3.r0.g06afbc4c-1

Git Clone URL: https://aur.archlinux.org/lutris-git.git (read-only)
Package Base: lutris-git
Description: Open Gaming Platform
Upstream URL: https://lutris.net/
Keywords: client gaming lutris
Licenses: GPL3
Conflicts: lutris
Provides: lutris
Submitter: ProfessorKaos64
Maintainer: VlinkZ
Last Packager: VlinkZ
Votes: 14
Popularity: 1.869203
First Submitted: 2017-12-17 21:07
Last Updated: 2019-09-08 01:03

Dependencies (26)

Required by (0)

Sources (1)

Latest Comments

1 2 Next › Last »

telans commented on 2019-10-07 20:59

I believe this requires a python-requests package. Fails to build.

ERROR: Failure: ModuleNotFoundError (No module named 'requests')

OxHaK commented on 2019-09-28 16:35

Can't install this git and can't run the no git version: Something missing ? An idea please ?

==> Création du paquet lutris-git 0.5.3.r0.g06afbc4c-1 (sam. 28 sept. 2019 18:58:03 CEST) ==> Récupération des sources… -> Clonage du dépôt lutris git… Clonage dans le dépôt nu '/home/oxhak/.cache/yay/lutris-git/lutris' remote: Enumerating objects: 17, done. remote: Counting objects: 100% (17/17), done. remote: Compressing objects: 100% (17/17), done. remote: Total 35827 (delta 6), reused 0 (delta 0), pack-reused 35810 Réception d'objets: 100% (35827/35827), 12.34 Mio | 2.46 Mio/s, fait. Résolution des deltas: 100% (26811/26811), fait. ==> Validation des fichiers source avec sha256sums… lutris ... Ignoré ==> Nettoyage… python-yaml not satisfied, flushing install queue==> Création du paquet lutris-git 0.5.3.r0.g06afbc4c-1 (sam. 28 sept. 2019 18:58:10 CEST) ==> Vérification des dépendances pour l’exécution… ==> Vérification des dépendances pour la compilation… ==> Récupération des sources… -> Mise à jour du dépôt lutris git Récupération de origin ==> Validation des fichiers source avec sha256sums… lutris ... Ignoré ==> Suppression du répertoire $srcdir/ existant… ==> Extraction des sources… -> Création d’une copie de travail du dépot lutris git… Clonage dans 'lutris'... fait. ==> Lancement de pkgver()… ==> Version mise à jour : lutris-git 0.5.3.r24.gab24c781-1 ==> Les sources sont prêtes. ==> Création du paquet lutris-git 0.5.3.r24.gab24c781-1 (sam. 28 sept. 2019 18:58:12 CEST) ==> Vérification des dépendances pour l’exécution… ==> Vérification des dépendances pour la compilation… ==> ATTENTION : Utilisation de l’arbre $srcdir/ existant ==> Lancement de pkgver()… ==> Lancement de check()… EE..Traceback (most recent call last): File "bin/lutris-wrapper", line 138, in <module> main() File "bin/lutris-wrapper", line 109, in main returncode = subprocess.run(args).returncode File "/usr/lib/python3.7/site-packages/run/init.py", line 145, in new process = cls.create_process(command, stdin, cwd=cwd, env=env, shell=shell) File "/usr/lib/python3.7/site-packages/run/init.py", line 121, in create_process shlex.split(command), File "/usr/lib/python3.7/shlex.py", line 305, in split return list(lex) File "/usr/lib/python3.7/shlex.py", line 295, in next token = self.get_token() File "/usr/lib/python3.7/shlex.py", line 105, in get_token raw = self.read_token() File "/usr/lib/python3.7/shlex.py", line 136, in read_token nextchar = self.instream.read(1) AttributeError: 'list' object has no attribute 'read' EFEEE/home/oxhak/.cache/yay/lutris-git/src/lutris/lutris/util/display.py:7: PyGIWarning: GnomeDesktop was imported without specifying a version first. Use gi.require_version('GnomeDesktop', '3.0') before import to ensure that the right version gets loaded. from gi.repository import Gdk, GnomeDesktop, GLib EEEE ====================================================================== ERROR: Failure: AttributeError ('list' object has no attribute 'read')


Traceback (most recent call last): File "/usr/lib/python3.7/site-packages/nose/failure.py", line 39, in runTest raise self.exc_val.with_traceback(self.tb) File "/usr/lib/python3.7/site-packages/nose/loader.py", line 417, in loadTestsFromName addr.filename, addr.module) File "/usr/lib/python3.7/site-packages/nose/importer.py", line 47, in importFromPath return self.importFromDir(dir_path, fqname) File "/usr/lib/python3.7/site-packages/nose/importer.py", line 94, in importFromDir mod = load_module(part_fqname, fh, filename, desc) File "/usr/lib/python3.7/imp.py", line 244, in load_module return load_package(name, filename) File "/usr/lib/python3.7/imp.py", line 216, in load_package return _load(spec) File "<frozen importlib._bootstrap>", line 696, in _load File "<frozen importlib._bootstrap>", line 677, in _load_unlocked File "<frozen importlib._bootstrap_external>", line 728, in exec_module File "<frozen importlib._bootstrap>", line 219, in _call_with_frames_removed File "/home/oxhak/.cache/yay/lutris-git/src/lutris/lutris/gui/dialogs/init.py", line 5, in <module> from lutris import api, pga, runtime, settings File "/home/oxhak/.cache/yay/lutris-git/src/lutris/lutris/api.py", line 11, in <module> from lutris.util import resources File "/home/oxhak/.cache/yay/lutris-git/src/lutris/lutris/util/resources.py", line 8, in <module> from lutris.util import system File "/home/oxhak/.cache/yay/lutris-git/src/lutris/lutris/util/system.py", line 10, in <module> from lutris.util.linux import LINUX_SYSTEM File "/home/oxhak/.cache/yay/lutris-git/src/lutris/lutris/util/linux.py", line 402, in <module> LINUX_SYSTEM = LinuxSystem() File "/home/oxhak/.cache/yay/lutris-git/src/lutris/lutris/util/linux.py", line 126, in init self.shared_libraries = self.get_shared_libraries() File "/home/oxhak/.cache/yay/lutris-git/src/lutris/lutris/util/linux.py", line 316, in get_shared_libraries for lib_line in self.get_ldconfig_libs(): File "/home/oxhak/.cache/yay/lutris-git/src/lutris/lutris/util/linux.py", line 305, in get_ldconfig_libs output = subprocess.check_output([ldconfig, "-p"]).decode("utf-8").split("\n") File "/usr/lib/python3.7/subprocess.py", line 395, in check_output **kwargs).stdout File "/usr/lib/python3.7/site-packages/run/init.py", line 145, in new process = cls.create_process(command, stdin, cwd=cwd, env=env, shell=shell) File "/usr/lib/python3.7/site-packages/run/init.py", line 121, in create_process shlex.split(command), File "/usr/lib/python3.7/shlex.py", line 305, in split return list(lex) File "/usr/lib/python3.7/shlex.py", line 295, in next token = self.get_token() File "/usr/lib/python3.7/shlex.py", line 105, in get_token raw = self.read_token() File "/usr/lib/python3.7/shlex.py", line 136, in read_token nextchar = self.instream.read(1) AttributeError: 'list' object has no attribute 'read'

====================================================================== ERROR: Failure: AttributeError ('list' object has no attribute 'read')


Traceback (most recent call last): File "/usr/lib/python3.7/site-packages/nose/failure.py", line 39, in runTest raise self.exc_val.with_traceback(self.tb) File "/usr/lib/python3.7/site-packages/nose/loader.py", line 417, in loadTestsFromName addr.filename, addr.module) File "/usr/lib/python3.7/site-packages/nose/importer.py", line 47, in importFromPath return self.importFromDir(dir_path, fqname) File "/usr/lib/python3.7/site-packages/nose/importer.py", line 94, in importFromDir mod = load_module(part_fqname, fh, filename, desc) File "/usr/lib/python3.7/imp.py", line 234, in load_module return load_source(name, filename, file) File "/usr/lib/python3.7/imp.py", line 171, in load_source module = _load(spec) File "<frozen importlib._bootstrap>", line 696, in _load File "<frozen importlib._bootstrap>", line 677, in _load_unlocked File "<frozen importlib._bootstrap_external>", line 728, in exec_module File "<frozen importlib._bootstrap>", line 219, in _call_with_frames_removed File "/home/oxhak/.cache/yay/lutris-git/src/lutris/tests/test_dialogs.py", line 7, in <module> from lutris.game import Game File "/home/oxhak/.cache/yay/lutris-git/src/lutris/lutris/game.py", line 10, in <module> from lutris import pga File "/home/oxhak/.cache/yay/lutris-git/src/lutris/lutris/pga.py", line 10, in <module> from lutris.util import sql, system File "/home/oxhak/.cache/yay/lutris-git/src/lutris/lutris/util/system.py", line 10, in <module> from lutris.util.linux import LINUX_SYSTEM File "/home/oxhak/.cache/yay/lutris-git/src/lutris/lutris/util/linux.py", line 402, in <module> LINUX_SYSTEM = LinuxSystem() File "/home/oxhak/.cache/yay/lutris-git/src/lutris/lutris/util/linux.py", line 126, in init self.shared_libraries = self.get_shared_libraries() File "/home/oxhak/.cache/yay/lutris-git/src/lutris/lutris/util/linux.py", line 316, in get_shared_libraries for lib_line in self.get_ldconfig_libs(): File "/home/oxhak/.cache/yay/lutris-git/src/lutris/lutris/util/linux.py", line 305, in get_ldconfig_libs output = subprocess.check_output([ldconfig, "-p"]).decode("utf-8").split("\n") File "/usr/lib/python3.7/subprocess.py", line 395, in check_output **kwargs).stdout File "/usr/lib/python3.7/site-packages/run/init.py", line 145, in new process = cls.create_process(command, stdin, cwd=cwd, env=env, shell=shell) File "/usr/lib/python3.7/site-packages/run/init.py", line 121, in create_process shlex.split(command), File "/usr/lib/python3.7/shlex.py", line 305, in split return list(lex) File "/usr/lib/python3.7/shlex.py", line 295, in next token = self.get_token() File "/usr/lib/python3.7/shlex.py", line 105, in get_token raw = self.read_token() File "/usr/lib/python3.7/shlex.py", line 136, in read_token nextchar = self.instream.read(1) AttributeError: 'list' object has no attribute 'read'

====================================================================== ERROR: Failure: AttributeError ('list' object has no attribute 'read')


Traceback (most recent call last): File "/usr/lib/python3.7/site-packages/nose/failure.py", line 39, in runTest raise self.exc_val.with_traceback(self.tb) File "/usr/lib/python3.7/site-packages/nose/loader.py", line 417, in loadTestsFromName addr.filename, addr.module) File "/usr/lib/python3.7/site-packages/nose/importer.py", line 47, in importFromPath return self.importFromDir(dir_path, fqname) File "/usr/lib/python3.7/site-packages/nose/importer.py", line 94, in importFromDir mod = load_module(part_fqname, fh, filename, desc) File "/usr/lib/python3.7/imp.py", line 234, in load_module return load_source(name, filename, file) File "/usr/lib/python3.7/imp.py", line 171, in load_source module = _load(spec) File "<frozen importlib._bootstrap>", line 696, in _load File "<frozen importlib._bootstrap>", line 677, in _load_unlocked File "<frozen importlib._bootstrap_external>", line 728, in exec_module File "<frozen importlib._bootstrap>", line 219, in _call_with_frames_removed File "/home/oxhak/.cache/yay/lutris-git/src/lutris/tests/test_installer.py", line 2, in <module> from lutris.installer.interpreter import ScriptInterpreter File "/home/oxhak/.cache/yay/lutris-git/src/lutris/lutris/installer/interpreter.py", line 10, in <module> from lutris import pga File "/home/oxhak/.cache/yay/lutris-git/src/lutris/lutris/pga.py", line 10, in <module> from lutris.util import sql, system File "/home/oxhak/.cache/yay/lutris-git/src/lutris/lutris/util/system.py", line 10, in <module> from lutris.util.linux import LINUX_SYSTEM File "/home/oxhak/.cache/yay/lutris-git/src/lutris/lutris/util/linux.py", line 402, in <module> LINUX_SYSTEM = LinuxSystem() File "/home/oxhak/.cache/yay/lutris-git/src/lutris/lutris/util/linux.py", line 126, in init self.shared_libraries = self.get_shared_libraries() File "/home/oxhak/.cache/yay/lutris-git/src/lutris/lutris/util/linux.py", line 316, in get_shared_libraries for lib_line in self.get_ldconfig_libs(): File "/home/oxhak/.cache/yay/lutris-git/src/lutris/lutris/util/linux.py", line 305, in get_ldconfig_libs output = subprocess.check_output([ldconfig, "-p"]).decode("utf-8").split("\n") File "/usr/lib/python3.7/subprocess.py", line 395, in check_output **kwargs).stdout File "/usr/lib/python3.7/site-packages/run/init.py", line 145, in new process = cls.create_process(command, stdin, cwd=cwd, env=env, shell=shell) File "/usr/lib/python3.7/site-packages/run/init.py", line 121, in create_process shlex.split(command), File "/usr/lib/python3.7/shlex.py", line 305, in split return list(lex) File "/usr/lib/python3.7/shlex.py", line 295, in next token = self.get_token() File "/usr/lib/python3.7/shlex.py", line 105, in get_token raw = self.read_token() File "/usr/lib/python3.7/shlex.py", line 136, in read_token nextchar = self.instream.read(1) AttributeError: 'list' object has no attribute 'read'

====================================================================== ERROR: Failure: AttributeError ('list' object has no attribute 'read')


Traceback (most recent call last): File "/usr/lib/python3.7/site-packages/nose/failure.py", line 39, in runTest raise self.exc_val.with_traceback(self.tb) File "/usr/lib/python3.7/site-packages/nose/loader.py", line 417, in loadTestsFromName addr.filename, addr.module) File "/usr/lib/python3.7/site-packages/nose/importer.py", line 47, in importFromPath return self.importFromDir(dir_path, fqname) File "/usr/lib/python3.7/site-packages/nose/importer.py", line 94, in importFromDir mod = load_module(part_fqname, fh, filename, desc) File "/usr/lib/python3.7/imp.py", line 234, in load_module return load_source(name, filename, file) File "/usr/lib/python3.7/imp.py", line 171, in load_source module = _load(spec) File "<frozen importlib._bootstrap>", line 696, in _load File "<frozen importlib._bootstrap>", line 677, in _load_unlocked File "<frozen importlib._bootstrap_external>", line 728, in exec_module File "<frozen importlib._bootstrap>", line 219, in _call_with_frames_removed File "/home/oxhak/.cache/yay/lutris-git/src/lutris/tests/test_pga.py", line 4, in <module> from lutris import pga File "/home/oxhak/.cache/yay/lutris-git/src/lutris/lutris/pga.py", line 10, in <module> from lutris.util import sql, system File "/home/oxhak/.cache/yay/lutris-git/src/lutris/lutris/util/system.py", line 10, in <module> from lutris.util.linux import LINUX_SYSTEM File "/home/oxhak/.cache/yay/lutris-git/src/lutris/lutris/util/linux.py", line 402, in <module> LINUX_SYSTEM = LinuxSystem() File "/home/oxhak/.cache/yay/lutris-git/src/lutris/lutris/util/linux.py", line 126, in init self.shared_libraries = self.get_shared_libraries() File "/home/oxhak/.cache/yay/lutris-git/src/lutris/lutris/util/linux.py", line 316, in get_shared_libraries for lib_line in self.get_ldconfig_libs(): File "/home/oxhak/.cache/yay/lutris-git/src/lutris/lutris/util/linux.py", line 305, in get_ldconfig_libs output = subprocess.check_output([ldconfig, "-p"]).decode("utf-8").split("\n") File "/usr/lib/python3.7/subprocess.py", line 395, in check_output **kwargs).stdout File "/usr/lib/python3.7/site-packages/run/init.py", line 145, in new process = cls.create_process(command, stdin, cwd=cwd, env=env, shell=shell) File "/usr/lib/python3.7/site-packages/run/init.py", line 121, in create_process shlex.split(command), File "/usr/lib/python3.7/shlex.py", line 305, in split return list(lex) File "/usr/lib/python3.7/shlex.py", line 295, in next token = self.get_token() File "/usr/lib/python3.7/shlex.py", line 105, in get_token raw = self.read_token() File "/usr/lib/python3.7/shlex.py", line 136, in read_token nextchar = self.instream.read(1) AttributeError: 'list' object has no attribute 'read'

====================================================================== ERROR: Failure: AttributeError ('list' object has no attribute 'read')


Traceback (most recent call last): File "/usr/lib/python3.7/site-packages/nose/failure.py", line 39, in runTest raise self.exc_val.with_traceback(self.tb) File "/usr/lib/python3.7/site-packages/nose/loader.py", line 417, in loadTestsFromName addr.filename, addr.module) File "/usr/lib/python3.7/site-packages/nose/importer.py", line 47, in importFromPath return self.importFromDir(dir_path, fqname) File "/usr/lib/python3.7/site-packages/nose/importer.py", line 94, in importFromDir mod = load_module(part_fqname, fh, filename, desc) File "/usr/lib/python3.7/imp.py", line 234, in load_module return load_source(name, filename, file) File "/usr/lib/python3.7/imp.py", line 171, in load_source module = _load(spec) File "<frozen importlib._bootstrap>", line 696, in _load File "<frozen importlib._bootstrap>", line 677, in _load_unlocked File "<frozen importlib._bootstrap_external>", line 728, in exec_module File "<frozen importlib._bootstrap>", line 219, in _call_with_frames_removed File "/home/oxhak/.cache/yay/lutris-git/src/lutris/tests/test_registry.py", line 3, in <module> from lutris.util.wine.registry import WineRegistry, WineRegistryKey File "/home/oxhak/.cache/yay/lutris-git/src/lutris/lutris/util/wine/registry.py", line 6, in <module> from lutris.util import system File "/home/oxhak/.cache/yay/lutris-git/src/lutris/lutris/util/system.py", line 10, in <module> from lutris.util.linux import LINUX_SYSTEM File "/home/oxhak/.cache/yay/lutris-git/src/lutris/lutris/util/linux.py", line 402, in <module> LINUX_SYSTEM = LinuxSystem() File "/home/oxhak/.cache/yay/lutris-git/src/lutris/lutris/util/linux.py", line 126, in init self.shared_libraries = self.get_shared_libraries() File "/home/oxhak/.cache/yay/lutris-git/src/lutris/lutris/util/linux.py", line 316, in get_shared_libraries for lib_line in self.get_ldconfig_libs(): File "/home/oxhak/.cache/yay/lutris-git/src/lutris/lutris/util/linux.py", line 305, in get_ldconfig_libs output = subprocess.check_output([ldconfig, "-p"]).decode("utf-8").split("\n") File "/usr/lib/python3.7/subprocess.py", line 395, in check_output **kwargs).stdout File "/usr/lib/python3.7/site-packages/run/init.py", line 145, in new process = cls.create_process(command, stdin, cwd=cwd, env=env, shell=shell) File "/usr/lib/python3.7/site-packages/run/init.py", line 121, in create_process shlex.split(command), File "/usr/lib/python3.7/shlex.py", line 305, in split return list(lex) File "/usr/lib/python3.7/shlex.py", line 295, in next token = self.get_token() File "/usr/lib/python3.7/shlex.py", line 105, in get_token raw = self.read_token() File "/usr/lib/python3.7/shlex.py", line 136, in read_token nextchar = self.instream.read(1) AttributeError: 'list' object has no attribute 'read'

====================================================================== ERROR: Failure: AttributeError ('list' object has no attribute 'read')


Traceback (most recent call last): File "/usr/lib/python3.7/site-packages/nose/failure.py", line 39, in runTest raise self.exc_val.with_traceback(self.tb) File "/usr/lib/python3.7/site-packages/nose/loader.py", line 417, in loadTestsFromName addr.filename, addr.module) File "/usr/lib/python3.7/site-packages/nose/importer.py", line 47, in importFromPath return self.importFromDir(dir_path, fqname) File "/usr/lib/python3.7/site-packages/nose/importer.py", line 94, in importFromDir mod = load_module(part_fqname, fh, filename, desc) File "/usr/lib/python3.7/imp.py", line 234, in load_module return load_source(name, filename, file) File "/usr/lib/python3.7/imp.py", line 171, in load_source module = _load(spec) File "<frozen importlib._bootstrap>", line 696, in _load File "<frozen importlib._bootstrap>", line 677, in _load_unlocked File "<frozen importlib._bootstrap_external>", line 728, in exec_module File "<frozen importlib._bootstrap>", line 219, in _call_with_frames_removed File "/home/oxhak/.cache/yay/lutris-git/src/lutris/tests/test_resources.py", line 3, in <module> from lutris.api import parse_installer_url File "/home/oxhak/.cache/yay/lutris-git/src/lutris/lutris/api.py", line 11, in <module> from lutris.util import resources File "/home/oxhak/.cache/yay/lutris-git/src/lutris/lutris/util/resources.py", line 8, in <module> from lutris.util import system File "/home/oxhak/.cache/yay/lutris-git/src/lutris/lutris/util/system.py", line 10, in <module> from lutris.util.linux import LINUX_SYSTEM File "/home/oxhak/.cache/yay/lutris-git/src/lutris/lutris/util/linux.py", line 402, in <module> LINUX_SYSTEM = LinuxSystem() File "/home/oxhak/.cache/yay/lutris-git/src/lutris/lutris/util/linux.py", line 126, in init self.shared_libraries = self.get_shared_libraries() File "/home/oxhak/.cache/yay/lutris-git/src/lutris/lutris/util/linux.py", line 316, in get_shared_libraries for lib_line in self.get_ldconfig_libs(): File "/home/oxhak/.cache/yay/lutris-git/src/lutris/lutris/util/linux.py", line 305, in get_ldconfig_libs output = subprocess.check_output([ldconfig, "-p"]).decode("utf-8").split("\n") File "/usr/lib/python3.7/subprocess.py", line 395, in check_output **kwargs).stdout File "/usr/lib/python3.7/site-packages/run/init.py", line 145, in new process = cls.create_process(command, stdin, cwd=cwd, env=env, shell=shell) File "/usr/lib/python3.7/site-packages/run/init.py", line 121, in create_process shlex.split(command), File "/usr/lib/python3.7/shlex.py", line 305, in split return list(lex) File "/usr/lib/python3.7/shlex.py", line 295, in next token = self.get_token() File "/usr/lib/python3.7/shlex.py", line 105, in get_token raw = self.read_token() File "/usr/lib/python3.7/shlex.py", line 136, in read_token nextchar = self.instream.read(1) AttributeError: 'list' object has no attribute 'read'

====================================================================== ERROR: Failure: AttributeError ('list' object has no attribute 'read')


Traceback (most recent call last): File "/usr/lib/python3.7/site-packages/nose/failure.py", line 39, in runTest raise self.exc_val.with_traceback(self.tb) File "/usr/lib/python3.7/site-packages/nose/loader.py", line 417, in loadTestsFromName addr.filename, addr.module) File "/usr/lib/python3.7/site-packages/nose/importer.py", line 47, in importFromPath return self.importFromDir(dir_path, fqname) File "/usr/lib/python3.7/site-packages/nose/importer.py", line 94, in importFromDir mod = load_module(part_fqname, fh, filename, desc) File "/usr/lib/python3.7/imp.py", line 234, in load_module return load_source(name, filename, file) File "/usr/lib/python3.7/imp.py", line 171, in load_source module = _load(spec) File "<frozen importlib._bootstrap>", line 696, in _load File "<frozen importlib._bootstrap>", line 677, in _load_unlocked File "<frozen importlib._bootstrap_external>", line 728, in exec_module File "<frozen importlib._bootstrap>", line 219, in _call_with_frames_removed File "/home/oxhak/.cache/yay/lutris-git/src/lutris/tests/test_runners.py", line 4, in <module> from lutris.config import LutrisConfig File "/home/oxhak/.cache/yay/lutris-git/src/lutris/lutris/config.py", line 6, in <module> from lutris import settings, sysoptions File "/home/oxhak/.cache/yay/lutris-git/src/lutris/lutris/sysoptions.py", line 7, in <module> from lutris.util import display, system File "/home/oxhak/.cache/yay/lutris-git/src/lutris/lutris/util/display.py", line 9, in <module> from lutris.util import system File "/home/oxhak/.cache/yay/lutris-git/src/lutris/lutris/util/system.py", line 10, in <module> from lutris.util.linux import LINUX_SYSTEM File "/home/oxhak/.cache/yay/lutris-git/src/lutris/lutris/util/linux.py", line 402, in <module> LINUX_SYSTEM = LinuxSystem() File "/home/oxhak/.cache/yay/lutris-git/src/lutris/lutris/util/linux.py", line 126, in init self.shared_libraries = self.get_shared_libraries() File "/home/oxhak/.cache/yay/lutris-git/src/lutris/lutris/util/linux.py", line 316, in get_shared_libraries for lib_line in self.get_ldconfig_libs(): File "/home/oxhak/.cache/yay/lutris-git/src/lutris/lutris/util/linux.py", line 305, in get_ldconfig_libs output = subprocess.check_output([ldconfig, "-p"]).decode("utf-8").split("\n") File "/usr/lib/python3.7/subprocess.py", line 395, in check_output **kwargs).stdout File "/usr/lib/python3.7/site-packages/run/init.py", line 145, in new process = cls.create_process(command, stdin, cwd=cwd, env=env, shell=shell) File "/usr/lib/python3.7/site-packages/run/init.py", line 121, in create_process shlex.split(command), File "/usr/lib/python3.7/shlex.py", line 305, in split return list(lex) File "/usr/lib/python3.7/shlex.py", line 295, in next token = self.get_token() File "/usr/lib/python3.7/shlex.py", line 105, in get_token raw = self.read_token() File "/usr/lib/python3.7/shlex.py", line 136, in read_token nextchar = self.instream.read(1) AttributeError: 'list' object has no attribute 'read'

====================================================================== ERROR: Failure: AttributeError ('list' object has no attribute 'read')


Traceback (most recent call last): File "/usr/lib/python3.7/site-packages/nose/failure.py", line 39, in runTest raise self.exc_val.with_traceback(self.tb) File "/usr/lib/python3.7/site-packages/nose/loader.py", line 417, in loadTestsFromName addr.filename, addr.module) File "/usr/lib/python3.7/site-packages/nose/importer.py", line 47, in importFromPath return self.importFromDir(dir_path, fqname) File "/usr/lib/python3.7/site-packages/nose/importer.py", line 94, in importFromDir mod = load_module(part_fqname, fh, filename, desc) File "/usr/lib/python3.7/imp.py", line 234, in load_module return load_source(name, filename, file) File "/usr/lib/python3.7/imp.py", line 171, in load_source module = _load(spec) File "<frozen importlib._bootstrap>", line 696, in _load File "<frozen importlib._bootstrap>", line 677, in _load_unlocked File "<frozen importlib._bootstrap_external>", line 728, in exec_module File "<frozen importlib._bootstrap>", line 219, in _call_with_frames_removed File "/home/oxhak/.cache/yay/lutris-git/src/lutris/tests/test_snes9x.py", line 4, in <module> from lutris.runners.snes9x import snes9x File "/home/oxhak/.cache/yay/lutris-git/src/lutris/lutris/runners/snes9x.py", line 6, in <module> from lutris.runners.runner import Runner File "/home/oxhak/.cache/yay/lutris-git/src/lutris/lutris/runners/runner.py", line 6, in <module> from lutris import pga, settings, runtime File "/home/oxhak/.cache/yay/lutris-git/src/lutris/lutris/pga.py", line 10, in <module> from lutris.util import sql, system File "/home/oxhak/.cache/yay/lutris-git/src/lutris/lutris/util/system.py", line 10, in <module> from lutris.util.linux import LINUX_SYSTEM File "/home/oxhak/.cache/yay/lutris-git/src/lutris/lutris/util/linux.py", line 402, in <module> LINUX_SYSTEM = LinuxSystem() File "/home/oxhak/.cache/yay/lutris-git/src/lutris/lutris/util/linux.py", line 126, in init self.shared_libraries = self.get_shared_libraries() File "/home/oxhak/.cache/yay/lutris-git/src/lutris/lutris/util/linux.py", line 316, in get_shared_libraries for lib_line in self.get_ldconfig_libs(): File "/home/oxhak/.cache/yay/lutris-git/src/lutris/lutris/util/linux.py", line 305, in get_ldconfig_libs output = subprocess.check_output([ldconfig, "-p"]).decode("utf-8").split("\n") File "/usr/lib/python3.7/subprocess.py", line 395, in check_output **kwargs).stdout File "/usr/lib/python3.7/site-packages/run/init.py", line 145, in new process = cls.create_process(command, stdin, cwd=cwd, env=env, shell=shell) File "/usr/lib/python3.7/site-packages/run/init.py", line 121, in create_process shlex.split(command), File "/usr/lib/python3.7/shlex.py", line 305, in split return list(lex) File "/usr/lib/python3.7/shlex.py", line 295, in next token = self.get_token() File "/usr/lib/python3.7/shlex.py", line 105, in get_token raw = self.read_token() File "/usr/lib/python3.7/shlex.py", line 136, in read_token nextchar = self.instream.read(1) AttributeError: 'list' object has no attribute 'read'

====================================================================== ERROR: Failure: AttributeError ('list' object has no attribute 'read')


Traceback (most recent call last): File "/usr/lib/python3.7/site-packages/nose/failure.py", line 39, in runTest raise self.exc_val.with_traceback(self.tb) File "/usr/lib/python3.7/site-packages/nose/loader.py", line 417, in loadTestsFromName addr.filename, addr.module) File "/usr/lib/python3.7/site-packages/nose/importer.py", line 47, in importFromPath return self.importFromDir(dir_path, fqname) File "/usr/lib/python3.7/site-packages/nose/importer.py", line 94, in importFromDir mod = load_module(part_fqname, fh, filename, desc) File "/usr/lib/python3.7/imp.py", line 234, in load_module return load_source(name, filename, file) File "/usr/lib/python3.7/imp.py", line 171, in load_source module = _load(spec) File "<frozen importlib._bootstrap>", line 696, in _load File "<frozen importlib._bootstrap>", line 677, in _load_unlocked File "<frozen importlib._bootstrap_external>", line 728, in exec_module File "<frozen importlib._bootstrap>", line 219, in _call_with_frames_removed File "/home/oxhak/.cache/yay/lutris-git/src/lutris/tests/test_utils.py", line 4, in <module> from lutris.util import system File "/home/oxhak/.cache/yay/lutris-git/src/lutris/lutris/util/system.py", line 10, in <module> from lutris.util.linux import LINUX_SYSTEM File "/home/oxhak/.cache/yay/lutris-git/src/lutris/lutris/util/linux.py", line 402, in <module> LINUX_SYSTEM = LinuxSystem() File "/home/oxhak/.cache/yay/lutris-git/src/lutris/lutris/util/linux.py", line 126, in init self.shared_libraries = self.get_shared_libraries() File "/home/oxhak/.cache/yay/lutris-git/src/lutris/lutris/util/linux.py", line 316, in get_shared_libraries for lib_line in self.get_ldconfig_libs(): File "/home/oxhak/.cache/yay/lutris-git/src/lutris/lutris/util/linux.py", line 305, in get_ldconfig_libs output = subprocess.check_output([ldconfig, "-p"]).decode("utf-8").split("\n") File "/usr/lib/python3.7/subprocess.py", line 395, in check_output **kwargs).stdout File "/usr/lib/python3.7/site-packages/run/init.py", line 145, in new process = cls.create_process(command, stdin, cwd=cwd, env=env, shell=shell) File "/usr/lib/python3.7/site-packages/run/init.py", line 121, in create_process shlex.split(command), File "/usr/lib/python3.7/shlex.py", line 305, in split return list(lex) File "/usr/lib/python3.7/shlex.py", line 295, in next token = self.get_token() File "/usr/lib/python3.7/shlex.py", line 105, in get_token raw = self.read_token() File "/usr/lib/python3.7/shlex.py", line 136, in read_token nextchar = self.instream.read(1) AttributeError: 'list' object has no attribute 'read'

====================================================================== ERROR: Failure: AttributeError ('list' object has no attribute 'read')


Traceback (most recent call last): File "/usr/lib/python3.7/site-packages/nose/failure.py", line 39, in runTest raise self.exc_val.with_traceback(self.tb) File "/usr/lib/python3.7/site-packages/nose/loader.py", line 417, in loadTestsFromName addr.filename, addr.module) File "/usr/lib/python3.7/site-packages/nose/importer.py", line 47, in importFromPath return self.importFromDir(dir_path, fqname) File "/usr/lib/python3.7/site-packages/nose/importer.py", line 94, in importFromDir mod = load_module(part_fqname, fh, filename, desc) File "/usr/lib/python3.7/imp.py", line 234, in load_module return load_source(name, filename, file) File "/usr/lib/python3.7/imp.py", line 171, in load_source module = _load(spec) File "<frozen importlib._bootstrap>", line 696, in _load File "<frozen importlib._bootstrap>", line 677, in _load_unlocked File "<frozen importlib._bootstrap_external>", line 728, in exec_module File "<frozen importlib._bootstrap>", line 219, in _call_with_frames_removed File "/home/oxhak/.cache/yay/lutris-git/src/lutris/tests/test_wine.py", line 2, in <module> from lutris.runners import wine File "/home/oxhak/.cache/yay/lutris-git/src/lutris/lutris/runners/wine.py", line 7, in <module> from lutris import runtime File "/home/oxhak/.cache/yay/lutris-git/src/lutris/lutris/runtime.py", line 7, in <module> from lutris.util import http, jobs, system File "/home/oxhak/.cache/yay/lutris-git/src/lutris/lutris/util/system.py", line 10, in <module> from lutris.util.linux import LINUX_SYSTEM File "/home/oxhak/.cache/yay/lutris-git/src/lutris/lutris/util/linux.py", line 402, in <module> LINUX_SYSTEM = LinuxSystem() File "/home/oxhak/.cache/yay/lutris-git/src/lutris/lutris/util/linux.py", line 126, in init self.shared_libraries = self.get_shared_libraries() File "/home/oxhak/.cache/yay/lutris-git/src/lutris/lutris/util/linux.py", line 316, in get_shared_libraries for lib_line in self.get_ldconfig_libs(): File "/home/oxhak/.cache/yay/lutris-git/src/lutris/lutris/util/linux.py", line 305, in get_ldconfig_libs output = subprocess.check_output([ldconfig, "-p"]).decode("utf-8").split("\n") File "/usr/lib/python3.7/subprocess.py", line 395, in check_output **kwargs).stdout File "/usr/lib/python3.7/site-packages/run/init.py", line 145, in new process = cls.create_process(command, stdin, cwd=cwd, env=env, shell=shell) File "/usr/lib/python3.7/site-packages/run/init.py", line 121, in create_process shlex.split(command), File "/usr/lib/python3.7/shlex.py", line 305, in split return list(lex) File "/usr/lib/python3.7/shlex.py", line 295, in next token = self.get_token() File "/usr/lib/python3.7/shlex.py", line 105, in get_token raw = self.read_token() File "/usr/lib/python3.7/shlex.py", line 136, in read_token nextchar = self.instream.read(1) AttributeError: 'list' object has no attribute 'read'

====================================================================== FAIL: Test that nonresponsive child processes can be killed with 2x sigterm


Traceback (most recent call last): File "/home/oxhak/.cache/yay/lutris-git/src/lutris/tests/test_lutris_wrapper.py", line 44, in test_cleanup_children self.fail("stdout EOF unexpectedly") AssertionError: stdout EOF unexpectedly

Name Stmts Miss Cover

lutris/init.py 1 0 100% lutris/gui/init.py 0 0 100% lutris/gui/config/init.py 2 0 100% lutris/gui/views/init.py 2 0 100% lutris/gui/widgets/init.py 0 0 100% lutris/installer/init.py 0 0 100% lutris/migrations/init.py 18 10 44% lutris/runners/init.py 31 20 35% lutris/runners/commands/init.py 0 0 100% lutris/services/init.py 11 3 73% lutris/settings.py 31 0 100% lutris/util/init.py 10 9 10% lutris/util/disks.py 32 24 25% lutris/util/graphics/init.py 0 0 100% lutris/util/graphics/drivers.py 67 54 19% lutris/util/graphics/glxinfo.py 39 8 79% lutris/util/http.py 98 79 19% lutris/util/jobs.py 36 26 28% lutris/util/log.py 21 1 95% lutris/util/settings.py 25 11 56% lutris/util/sql.py 95 80 16% lutris/util/steam/init.py 0 0 100% lutris/util/strings.py 68 56 18% lutris/util/wine/init.py 0 0 100% lutris/vendor/init.py 0 0 100% lutris/vendor/distro.py 292 213 27%


TOTAL 879 594 32%

Ran 13 tests in 0.367s

FAILED (errors=10, failures=1) ==> ERREUR : Une erreur s’est produite dans check(). Abandon… Error making: lutris-git

ProfessorKaos64 commented on 2019-09-08 13:59

Thanks for the report Thulinma, i'll get that added if so.

Thulinma commented on 2019-09-08 00:23

It looks like python-nose is now a new build dependency.

mferraci commented on 2019-08-25 21:25

It's built based on last commit of Lutris Git Master branch.

tarmabal commented on 2019-08-11 06:29

I would like to know how to update this package to the latest git update 0.5.2.2

Latest commit 2a85712e37f2371c474c663c3c87fec6fcfd4027

Right now building the package only gives me lutris 0.5.2.1

tannisroot commented on 2019-02-14 23:37

Lutris doesn't depend on unrar anymore

Zeioth commented on 2019-02-11 21:55

Proposal: Add gamemode as optional package.

Libstrangle should be added as hard dependency since it's used game some game's installers, but sadly it doesn't exist outside of AUR yet.

VlinkZ commented on 2019-01-28 22:30

Everything should work now. Please let me know if you have any problems.

parkerlreed commented on 2019-01-25 20:43

gnome-desktop python-pillow are new runtime dependenices