Package Details: luxrays-hg 3573+.ce44b2b9fe6e+-1

Git Clone URL: https://aur.archlinux.org/luxrays-hg.git (read-only)
Package Base: luxrays-hg
Description: Accelerate the ray intersection process by using GPUs
Upstream URL: http://www.luxrender.net/
Licenses: GPL
Conflicts: luxrays
Provides: luxrays
Submitter: None
Maintainer: stativ
Last Packager: stativ
Votes: 7
Popularity: 0.000003
First Submitted: 2010-09-07 21:57
Last Updated: 2016-08-02 18:46

Dependencies (21)

Required by (1)

Sources (2)

Latest Comments

bartus commented on 2016-07-06 10:07

As Arch drop ilmbase-static package luxrays wont build without patching CMakeList.txt for luxcoreui.
Simple hucky patch fixing the issue: http://pastebin.com/2K1wmG33

stativ commented on 2016-03-13 18:38

Thank you for suggestions, currently I've a lot of work, but I'll try to incorporate them soon. I'd like to find a better solution to fix python linking, but the few ones I tried so far didn't work.

bartus commented on 2016-03-13 00:22

You need to disable build of luxrender2 as it needs static ilmbase which is not provided by any package.

bartus commented on 2016-02-17 00:25

'python3.patch' is broken.
Also -lpython3 flag's missing form every link.txt file.
> quick fix: `for file in `grep lboost_python -l -R ` ;do sed -i 's/$/ -lpython3/' $file ; done`

fixme commented on 2014-05-07 09:33

openimageio is needed as a dependency

stativ commented on 2013-04-30 13:10

Updated for the new pacman.

stativ commented on 2012-03-24 10:11

fixed

Zell_89 commented on 2012-03-20 22:56

/usr/bin/ld: /usr/lib/gcc/x86_64-unknown-linux-gnu/4.6.3/../../../../lib/libboost_thread.a(once.o): undefined reference to symbol 'pthread_once@@GLIBC_2.2.5'
/usr/bin/ld: note: 'pthread_once@@GLIBC_2.2.5' is defined in DSO /lib/libpthread.so.0 so try adding it to the linker command line
/lib/libpthread.so.0: could not read symbols: Invalid operation
collect2: ld returned 1 exit status
make[2]: *** [bin/benchsimple] Errore 1
make[1]: *** [samples/benchsimple/CMakeFiles/benchsimple.dir/all] Errore 2
make: *** [all] Errore 2

Zell_89 commented on 2012-03-20 22:51

/usr/bin/ld: /usr/lib/gcc/x86_64-unknown-linux-gnu/4.6.3/../../../../lib/libboost_thread.a(once.o): undefined reference to symbol 'pthread_once@@GLIBC_2.2.5'
/usr/bin/ld: note: 'pthread_once@@GLIBC_2.2.5' is defined in DSO /lib/libpthread.so.0 so try adding it to the linker command line
/lib/libpthread.so.0: could not read symbols: Invalid operation
collect2: ld returned 1 exit status
make[2]: *** [bin/benchsimple] Errore 1
make[1]: *** [samples/benchsimple/CMakeFiles/benchsimple.dir/all] Errore 2
make: *** [all] Errore 2

lubosz commented on 2011-09-06 01:28

The google code repo was not updated since one year.

Script with current repository and correct blender directory:
http://paste.pocoo.org/show/471070/

All comments