Package Details: luxrender-hg 4918+.f56582df55f4+-6

Git Clone URL: https://aur.archlinux.org/luxrender-hg.git (read-only)
Package Base: luxrender-hg
Description: Rendering system for physically correct, unbiased image synthesis
Upstream URL: http://www.luxrender.net/
Licenses: GPL
Conflicts: luxrender
Provides: luxrender
Submitter: stativ
Maintainer: stativ (bartus)
Last Packager: bartus
Votes: 6
Popularity: 0.000000
First Submitted: 2009-07-16 15:50
Last Updated: 2018-11-07 15:14

Dependencies (22)

Required by (1)

Sources (6)

Latest Comments

« First ‹ Previous 1 2 3 4 5 Next › Last »

stativ commented on 2011-03-10 18:14

I can't update the package, because luxrender.net seems to be down for a last few days and I don't have the current source clone.

Anonymous comment on 2011-03-09 07:41

Hi,

Since Boost updated here's the problem

[ 76%] Building CXX object CMakeFiles/luxcomp.dir/tools/luxcomp.o
/tmp/yaourt-tmp-omar/aur-luxrender-hg/src/lux-build/tools/luxcomp.cpp: In function ‘void CheckFilePath(std::string)’:
/tmp/yaourt-tmp-omar/aur-luxrender-hg/src/lux-build/tools/luxcomp.cpp:57:39: erreur: invalid conversion from ‘bool (*)(const std::string&)’ to ‘boost::enable_if_c<true, void>::type*’
/tmp/yaourt-tmp-omar/aur-luxrender-hg/src/lux-build/tools/luxcomp.cpp:57:39: erreur: initializing argument 2 of ‘boost::filesystem3::path::path(const Source&, typename boost::enable_if<boost::filesystem3::path_traits::is_pathable<typename boost::decay<Source>::type> >::type*) [with Source = std::basic_string<char>, typename boost::enable_if<boost::filesystem3::path_traits::is_pathable<typename boost::decay<Source>::type> >::type = void]’
make[2]: *** [CMakeFiles/luxcomp.dir/tools/luxcomp.o] Erreur 1
make[1]: *** [CMakeFiles/luxcomp.dir/all] Erreur 2
make: *** [all] Erreur 2

Anonymous comment on 2010-09-16 14:50

stativ: thanks. it was from yesterday. now it builds and installs fine :)

stativ commented on 2010-09-16 14:35

rebegin: you need to use current PKGBUILD. The failing patch has been incorporated into the luxrender repository recently.

Anonymous comment on 2010-09-16 13:54

stativ: thanks for the answer. after several attempt it finally worked. but i got this error:
==> Starting make...
patching file core/external/cimg.h
Hunk #1 FAILED at 25679.
Hunk #2 FAILED at 25690.
2 out of 2 hunks FAILED -- saving rejects to file core/external/cimg.h.rej
Aborting...

stativ commented on 2010-09-15 08:14

rebegin: It's quite common error with luxrender mercurial repository. In short it's too big for server to handle. The only option is to wait and try again later. It may take quite o lot of attempts so I suggest not to remove successfully cloned repo. Otherwise you'll have to go through it again when you want to rebuild a package.

Anonymous comment on 2010-09-14 12:17

I get this error:
==> Determining latest hg revision...
requesting all changes
adding changesets
adding manifests
adding file changes
transaction abort!
rollback completed
abort: premature EOF reading chunk (got 2556059 bytes, expected 14768516)

stativ commented on 2010-09-09 07:44

goplexian: thank you!

I updated the PKBUILD to reflect change of the name.

Anonymous comment on 2010-09-08 21:35

The luxrays-hg package in Aur has now been updated.


http://aur.archlinux.org/packages.php?ID=40611

stativ commented on 2010-09-07 13:28

The luxrender-hg needs luxrays package to compile. The luxrays package in the AUR doesn't contain necessary files so until it gets updated use following PKGBUILD to build luxrays.

http://pastebin.com/bt3at5Fm