Package Details: mangohud 0.6.3-1

Git Clone URL: (read-only, click to copy)
Package Base: mangohud
Description: A Vulkan overlay layer for monitoring FPS, temperatures, CPU/GPU load and more
Upstream URL:
Keywords: hud vulkan
Licenses: MIT
Submitter: rsa
Maintainer: rsa
Last Packager: rsa
Votes: 83
Popularity: 9.66
First Submitted: 2020-02-05 03:44
Last Updated: 2021-06-11 21:05

Pinned Comments

rsa commented on 2020-06-11 17:53

Please do not flag the package out of date so immediately. I follow the releases of the GitHub repository so I will be warned of updates as soon as they release it. Flagging as out of date immediately has no effect, please wait 24h.

Latest Comments

1 2 3 4 5 6 Next › Last »

yochananmarqos commented on 2021-01-02 16:51

@rsa: Ha, you're right. Must've been a conflict between my PKGBUILD and this one. Why install the license twice?

rsa commented on 2021-01-02 14:06

@yochananmarqos there are no conflicting files, each package installs to their own license directory.

yochananmarqos commented on 2021-01-01 21:49

@rsa: I just noticed both mangohud & mangohud-common install the license so there are conflicting files. It should only be installed in the common package.

entropie commented on 2020-12-02 21:45

I am having issues with the git download link. A direct http download works, yet curl in the package manager breaks and so does the update:

curl: (22) The requested URL returned error: 416
==> FEHLER: Fehler beim Download von
    Breche ab...
Fehler beim Erstellen von mangohud

console update output:

curl: (33) HTTP server doesn't seem to support byte ranges. Cannot resume.

codl commented on 2020-12-01 18:10

Your recent update (0.6.1-2) fixed it, thanks.

When building a package in a clean chroot, only base-devel is preinstalled, not base or systemd, see

rsa commented on 2020-12-01 17:13

@codl dbus is a dependency of systemd, which is required for the base Arch Linux system.

If you are using something else, please mention it.

codl commented on 2020-11-08 22:14

DBus seems to be missing as a dependency:

==> Starting build()...
Run-time dependency vulkan found: YES 1.2.159
Run-time dependency threads found: YES
Did not find CMake 'cmake'
Found CMake: NO
Run-time dependency dbus-1 found: NO (tried pkgconfig)

MangoHud-0.5.1/ ERROR: Dependency "dbus-1" not found, tried pkgconfig

Maltahl commented on 2020-09-15 08:52

(EDIT: DISREGARD THIS it was vulkan-header-git package that broke this for me, switched to vulkan-header (non git) and now it works.

There is an error building current ( 0.5.1 ) first it errored out due to: MangoHud-0.5.1/ ERROR: File /usr/share/vulkan/registry/vk.xml
so i had to copy vk.xml as it has moved from /usr/share/vulkan/registry/ to /usr/share/vulkan/ sudo cp /usr/share/vulkan/vk.xml /usr/share/vulkan/registry/vk.xml

after that i get this error during build:

MangoHud v0.4.0

    dearimgui: YES

Option buildtype is: plain [default: release]
Found ninja-1.10.1 at /usr/bin/ninja
ninja: Entering directory `build64'
[4/45] Generating overlay.vert.spv.h with a custom command
[5/45] Generating overlay.frag.spv.h with a custom command
[6/45] Generating version.h with a custom command
fatal: No names found, cannot describe anything.
[10/45] Compiling C object src/
FAILED: src/
cc -Isrc/ -Isrc -I../MangoHud-0.5.1/src -I../MangoHud-0.5.1/include -Isubprojects/dearimgui -I../MangoHud-0.5.1/subprojects/dearimgui -I. -I/usr/include/dbus-1.0 -I/usr/lib/dbus-1.0/include -fvisibility=hidden -flto -fdiagnostics-color=always -pipe -D_FILE_OFFSET_BITS=64 -std=c99 -Werror=implicit-function-declaration -Werror=missing-prototypes -Werror=return-type -Werror=incompatible-pointer-types -fno-math-errno -fno-trapping-math -Wno-missing-field-initializers -Wno-format-truncation -march=x86-64 -mtune=generic -O2 -fstack-protector-strong -fno-plt -D_FORTIFY_SOURCE=2 -fPIC -pthread -D__STDC_CONSTANT_MACROS -D__STDC_FORMAT_MACROS -D__STDC_LIMIT_MACROS '-DPACKAGE_VERSION="v0.4.0"' -DNDEBUG -D_GNU_SOURCE -DHAVE_PTHREAD -DUSE_GCC_ATOMIC_BUILTINS -DHAVE_TIMESPEC_GET -DHAVE___BUILTIN_BSWAP32 -DHAVE___BUILTIN_BSWAP64 -DHAVE___BUILTIN_CLZ -DHAVE___BUILTIN_CLZLL -DHAVE___BUILTIN_CTZ -DHAVE___BUILTIN_EXPECT -DHAVE___BUILTIN_FFS -DHAVE___BUILTIN_FFSLL -DHAVE___BUILTIN_POPCOUNT -DHAVE___BUILTIN_POPCOUNTLL -DHAVE___BUILTIN_UNREACHABLE '-DMANGOHUD_ARCH="64bit"' -DHAVE_NVML -DHAVE_XNVCTRL -DHAVE_X11 -DHAVE_DBUS -Wno-override-init -DVK_USE_PLATFORM_XLIB_KHR -MD -MQ src/ -MF src/ -o src/ -c vk_enum_to_str.c
In file included from vk_enum_to_str.c:26:
/usr/include/vulkan/vulkan.h:21:10: fatal error: vulkan_core.h: No such file or directory
   21 | #include "vulkan_core.h"
      |          ^~~~~~~~~~~~~~~
compilation terminated.
[15/45] Compiling C++ object src/
FAILED: src/
c++ -Isrc/ -Isrc -I../MangoHud-0.5.1/src -I../MangoHud-0.5.1/include -Isubprojects/dearimgui -I../MangoHud-0.5.1/subprojects/dearimgui -I. -I/usr/include/dbus-1.0 -I/usr/lib/dbus-1.0/include -fvisibility=hidden -flto -fdiagnostics-color=always -pipe -D_FILE_OFFSET_BITS=64 -std=c++14 -Werror=return-type -fno-math-errno -fno-trapping-math -Wno-non-virtual-dtor -Wno-missing-field-initializers -Wno-format-truncation -march=x86-64 -mtune=generic -O2 -fstack-protector-strong -fno-plt -D_FORTIFY_SOURCE=2 -fPIC -pthread -D__STDC_CONSTANT_MACROS -D__STDC_FORMAT_MACROS -D__STDC_LIMIT_MACROS '-DPACKAGE_VERSION="v0.4.0"' -DNDEBUG -D_GNU_SOURCE -DHAVE_PTHREAD -DUSE_GCC_ATOMIC_BUILTINS -DHAVE_TIMESPEC_GET -DHAVE___BUILTIN_BSWAP32 -DHAVE___BUILTIN_BSWAP64 -DHAVE___BUILTIN_CLZ -DHAVE___BUILTIN_CLZLL -DHAVE___BUILTIN_CTZ -DHAVE___BUILTIN_EXPECT -DHAVE___BUILTIN_FFS -DHAVE___BUILTIN_FFSLL -DHAVE___BUILTIN_POPCOUNT -DHAVE___BUILTIN_POPCOUNTLL -DHAVE___BUILTIN_UNREACHABLE '-DMANGOHUD_ARCH="64bit"' -DHAVE_NVML -DHAVE_XNVCTRL -DHAVE_X11 -DHAVE_DBUS -DVK_USE_PLATFORM_XLIB_KHR -MD -MQ src/ -MF src/ -o src/ -c ../MangoHud-0.5.1/src/overlay.cpp
In file included from ../MangoHud-0.5.1/src/overlay.cpp:36:
/usr/include/vulkan/vulkan.h:21:10: fatal error: vulkan_core.h: No such file or directory
   21 | #include "vulkan_core.h"
      |          ^~~~~~~~~~~~~~~
compilation terminated.
[35/45] Compiling C++ object src/
ninja: build stopped: subcommand failed.
==> ERROR: A failure occurred in build().
error making: mangohud (mangohud-common mangohud)

Shished commented on 2020-08-23 07:30

This aur package has version 0.5.1 but when mangohud is working it reports version 0.4.0. Is this a mangohud bug or incorrectly built package?

gbr commented on 2020-08-23 05:48

@rsa Thanks for adding my suggestion! :) Just FIY: You forgot to remove a single parenthesis at line 44.