Package Details: megasync-daemon-git v3.1.4.0.0.g11a7ede0-1

Git Clone URL: https://aur.archlinux.org/megasync-git.git (read-only)
Package Base: megasync-git
Description: MEGASync daemon client. (GIT Version)
Upstream URL: https://mega.co.nz/#sync
Licenses: custom:MEGA
Conflicts: megasync-daemon
Provides: megasync-daemon
Submitter: sl1pkn07
Maintainer: sl1pkn07
Last Packager: sl1pkn07
Votes: 12
Popularity: 1.088625
First Submitted: 2016-03-12 18:32
Last Updated: 2017-07-18 20:39

Latest Comments

eimis commented on 2017-11-03 02:13

According to devs here https://github.com/meganz/MEGAsync/issues/132

./src/MEGAsync/src/MEGASync/google_breakpad/client/linux/handler/exception_handler.h
./src/MEGAsync/src/MEGASync/google_breakpad/client/linux/handler/exception_handler.cc
./src/MEGAsync/src/MEGASync/google_breakpad/client/linux/minidump_writer/minidump_writer.cc

need to be modified

for the lazy http://www.mediafire.com/file/abwkg77ytk8iehr/megasync-git-v3.1.4.0.5.gbb5eac0a-1-x86_64.pkg.tar.xz

adambot commented on 2017-10-05 19:15

will do -- thanks for the guidance!

sl1pkn07 commented on 2017-10-04 20:08

try with upstream bugtracker

https://github.com/meganz/MEGAsync/issues
https://github.com/meganz/sdk/issues

adambot commented on 2017-10-04 20:04

i get the following error when i try to build:

In file included from control/CrashHandler.cpp:15:0:
google_breakpad/client/linux/handler/exception_handler.h:192:21: error: field ‘context’ has incomplete type ‘google_breakpad::ucontext’
struct ucontext context;
^~~~~~~
google_breakpad/client/linux/handler/exception_handler.h:192:12: note: forward declaration of ‘struct google_breakpad::ucontext’
struct ucontext context;
^~~~~~~~
make: *** [Makefile:5282: CrashHandler.o] Error 1
==> ERROR: A failure occurred in build().
Aborting...
==> ERROR: Makepkg was unable to build megasync-git.

any help would be appreciated

sl1pkn07 commented on 2017-10-01 10:09

@greenbigfrog nothig to do here. reinstall and go (you need learn how git packages works)

greetings

sl1pkn07 commented on 2017-08-12 13:09

builds ok here (today)

prometheus commented on 2017-08-12 11:56

Fails to build:

{standard input}: Assembler messages:
{standard input}:100500: Warning: end of file not at end of a line; newline inserted
{standard input}:102186: Error: unknown pseudo-op: `.l'
{standard input}: Error: open CFI at the end of file; missing .cfi_endproc directive
g++: internal compiler error: Killed (program cc1plus)
Please submit a full bug report,
with preprocessed source if appropriate.
See <https://bugs.archlinux.org/> for instructions.
make: *** [Makefile:3643: megaclient.o] Error 4
==> ERROR: A failure occurred in build().
Aborting...

==> ERROR: the build failed
-> Status
failed (1): megasync-cli-git

sl1pkn07 commented on 2017-04-16 20:39

@kyb

try now

sl1pkn07 commented on 2017-04-16 19:27

with LC_ALL=C please

kyb commented on 2017-04-16 19:26

ошибка: не удалось завершить транзакцию (конфликтующие файлы)
/usr/bin/mega-cmd содержится и в 'fuse-megasync-git' и в 'megasync-cli-git'
/usr/bin/mega-exec содержится и в 'fuse-megasync-git' и в 'megasync-cli-git'
/usr/bin/mega-cmd содержится и в 'fuse-megasync-git' и в 'megasync-daemon-git'
/usr/bin/mega-exec содержится и в 'fuse-megasync-git' и в 'megasync-daemon-git'
/usr/bin/mega-cmd содержится и в 'megasync-cli-git' и в 'megasync-daemon-git'
/usr/bin/mega-exec содержится и в 'megasync-cli-git' и в 'megasync-daemon-git'
Обнаружены ошибки, пакеты не обновлены.
==> ВНИМАНИЕ: Ваши пакеты сохранены в /tmp/yaourt-tmp-kyb
==> ОШИБКА: невозможно обновить

All comments