Package Details: mesa-libgl-git 11.3.0_devel.81775.e79aa19-1

Git Clone URL: https://aur.archlinux.org/mesa-git.git (read-only)
Package Base: mesa-git
Description: Mesa 3-D graphics library
Upstream URL: http://mesa3d.sourceforge.net
Keywords: mesa X11
Licenses: custom
Conflicts: mesa-libgl
Provides: libgl=11.3.0-devel, mesa-libgl=11.3.0-devel
Replaces: mesa-libgl
Submitter: Krejzi
Maintainer: Lone_Wolf
Last Packager: Lone_Wolf
Votes: 139
Popularity: 2.036772
First Submitted: 2014-06-19 21:33
Last Updated: 2016-05-24 14:05

Required by (526)

Sources (2)

Latest Comments

Lone_Wolf commented on 2016-05-24 14:09

I've added libpthread-stubs as make dependency for now, but there are other solutions.

Will post in the forum mesa-git thread about this.
https://bbs.archlinux.org/viewtopic.php?id=212819

kerberizer commented on 2016-05-23 22:42

Hm, it seems that after this commit we need to pull in libpthread-stubs...

https://cgit.freedesktop.org/mesa/mesa/commit/?id=1f4869a2089c6172feff382e177d74ac68c241a7

Otherwise, configure complains that "Package requirements (pthread-stubs) were not met: No package 'pthread-stubs' found". Not sure if there isn't another solution.

kerberizer commented on 2016-04-30 13:39

Mesa master is supposed to be built against LLVM trunk, so I'm not sure if that wouldn't be an overkill and too much burden on Lone_Wolf. These compat changes happen fairly often, mainly because of Clover. Perhaps a sticky comment with a reminder to always build against latest LLVM trunk might be enough?

yurikoles commented on 2016-04-30 08:10

Last error was solved by upgrading llvm-svn.
Consider putting svn rev in deps.

yurikoles commented on 2016-04-30 07:28

Now I see antoher error: https://gist.github.com/yurikoles/1c6436c772b647fc3e6c74eca645ff09

Lone_Wolf commented on 2016-04-29 14:20

yurikoles,the cause of your error is probably listed above what you posted.

no errors here building 11.3.0_devel.80817.c750029 , please try again.

yurikoles commented on 2016-04-29 13:54

make[6]: *** Waiting for unfinished jobs....
/usr/bin/mkdir -p '/home/yurikoles/work/mesa-git/src/fakeinstall/usr/lib'
/usr/bin/mkdir -p '/home/yurikoles/work/mesa-git/src/fakeinstall/etc/vulkan/icd.d'
/bin/sh ../../../libtool --mode=install /usr/bin/install -c libvulkan_intel.la '/home/yurikoles/work/mesa-git/src/fakeinstall/usr/lib'
/usr/bin/mkdir -p '/home/yurikoles/work/mesa-git/src/fakeinstall/usr/include/vulkan'
/usr/bin/install -c -m 644 intel_icd.json '/home/yurikoles/work/mesa-git/src/fakeinstall/etc/vulkan/icd.d'
/usr/bin/install -c -m 644 ../../../include/vulkan/vk_platform.h ../../../include/vulkan/vulkan.h ../../../include/vulkan/vulkan_intel.h '/home/yurikoles/work/mesa-git/src/fakeinstall/usr/include/vulkan'
libtool: install: /usr/bin/install -c .libs/libvulkan_intel.so /home/yurikoles/work/mesa-git/src/fakeinstall/usr/lib/libvulkan_intel.so
libtool: install: /usr/bin/install -c .libs/libvulkan_intel.lai /home/yurikoles/work/mesa-git/src/fakeinstall/usr/lib/libvulkan_intel.la
libtool: warning: remember to run 'libtool --finish /usr/lib'
make[6]: Leaving directory '/home/yurikoles/work/mesa-git/src/mesa/src/intel/vulkan'
Makefile:1826: recipe for target 'install-am' failed
make[5]: *** [install-am] Error 2
make[5]: Leaving directory '/home/yurikoles/work/mesa-git/src/mesa/src/intel/vulkan'
Makefile:1660: recipe for target 'install-recursive' failed
make[4]: *** [install-recursive] Error 1
make[4]: Leaving directory '/home/yurikoles/work/mesa-git/src/mesa/src/intel/vulkan'
Makefile:1820: recipe for target 'install' failed
make[3]: *** [install] Error 2
make[3]: Leaving directory '/home/yurikoles/work/mesa-git/src/mesa/src/intel/vulkan'
Makefile:550: recipe for target 'install-recursive' failed
make[2]: *** [install-recursive] Error 1
make[2]: Leaving directory '/home/yurikoles/work/mesa-git/src/mesa/src/intel'
Makefile:690: recipe for target 'install-recursive' failed
make[1]: *** [install-recursive] Error 1
make[1]: Leaving directory '/home/yurikoles/work/mesa-git/src/mesa/src'
Makefile:639: recipe for target 'install-recursive' failed
make: *** [install-recursive] Error 1
==> ERROR: A failure occurred in build().
Aborting...

Lone_Wolf commented on 2016-04-28 22:10

vulkan support re-enabled.

Thanks, FadeMind.

FadeMind commented on 2016-04-28 18:04

BUG 95182 was fixed in https://cgit.freedesktop.org/mesa/mesa/commit/?id=6028a67641741cb4e14265440282481441efa9c8

Lone_Wolf commented on 2016-04-28 11:49

the patch is indeed no longer needed, but i found a new vulkan bug :

https://bugs.freedesktop.org/show_bug.cgi?id=95182

uploaded new version with vulkan support commented out.

All comments