Package Details: metview 5.7.0-1

Git Clone URL: https://aur.archlinux.org/metview.git (read-only)
Package Base: metview
Description: ECMWF interactive meteorological application
Upstream URL: https://software.ecmwf.int/wiki/display/METV/Metview
Licenses: Apache
Groups: science
Submitter: graziano
Maintainer: graziano
Last Packager: graziano
Votes: 2
Popularity: 0.000020
First Submitted: 2013-08-22 13:37
Last Updated: 2019-11-03 11:05

Latest Comments

pezzacolori commented on 2016-11-17 14:11

Solved: netcdf-cxx-legacy was already compiled on my machine some times ago (probably with an older vewrsion of gcc or whatever). By recompiling it solved the installation issue in metview.

pezzacolori commented on 2016-11-17 13:25

I get following error during installation (I have tried with both extra/netcdf-cxx 4.3.0-1 and aur/netcdf-cxx-legacy 4.2-2 installed):

.....
[ 20%] Linking CXX executable ../../bin/PottF
../../lib/libMvMars.a(files.c.o): In function `marstmp':
/home/pezzatti/aur/pacaur_packages/metview/src/Metview-4.7.0-Source/src/libMarsClient/files.c:21: warning: the use of `tempnam' is dangerous, better use `mkstemp'
/usr/bin/ld: warning: libnetcdf.so.12, needed by /usr/lib/gcc/x86_64-pc-linux-gnu/6.2.1/../../../../lib/libnetcdf_c++.so, not found (try using -rpath or -rpath-link)
/usr/lib/gcc/x86_64-pc-linux-gnu/6.2.1/../../../../lib/libnetcdf_c++.so: undefined reference to `nc_inq_unlimdim'
/usr/lib/gcc/x86_64-pc-linux-gnu/6.2.1/../../../../lib/libnetcdf_c++.so: undefined reference to `nc_get_vara_schar'
/usr/lib/gcc/x86_64-pc-linux-gnu/6.2.1/../../../../lib/libnetcdf_c++.so: undefined reference to `nc_inq_atttype'
/usr/lib/gcc/x86_64-pc-linux-gnu/6.2.1/../../../../lib/libnetcdf_c++.so: undefined reference to `nc_def_dim'
/usr/lib/gcc/x86_64-pc-linux-gnu/6.2.1/../../../../lib/libnetcdf_c++.so: undefined reference to `nc_get_att_short'
/usr/lib/gcc/x86_64-pc-linux-gnu/6.2.1/../../../../lib/libnetcdf_c++.so: undefined reference to `nc_abort'
/usr/lib/gcc/x86_64-pc-linux-gnu/6.2.1/../../../../lib/libnetcdf_c++.so: undefined reference to `nc_inq_ndims'
/usr/lib/gcc/x86_64-pc-linux-gnu/6.2.1/../../../../lib/libnetcdf_c++.so: undefined reference to `nc_put_vara_float'
/usr/lib/gcc/x86_64-pc-linux-gnu/6.2.1/../../../../lib/libnetcdf_c++.so: undefined reference to `nc_inq_natts'
/usr/lib/gcc/x86_64-pc-linux-gnu/6.2.1/../../../../lib/libnetcdf_c++.so: undefined reference to `nc_redef'
/usr/lib/gcc/x86_64-pc-linux-gnu/6.2.1/../../../../lib/libnetcdf_c++.so: undefined reference to `nc_put_att_schar'
/usr/lib/gcc/x86_64-pc-linux-gnu/6.2.1/../../../../lib/libnetcdf_c++.so: undefined reference to `nc_get_vara_short'
/usr/lib/gcc/x86_64-pc-linux-gnu/6.2.1/../../../../lib/libnetcdf_c++.so: undefined reference to `nc_inq_dimid'
/usr/lib/gcc/x86_64-pc-linux-gnu/6.2.1/../../../../lib/libnetcdf_c++.so: undefined reference to `nc_inq_attlen'
/usr/lib/gcc/x86_64-pc-linux-gnu/6.2.1/../../../../lib/libnetcdf_c++.so: undefined reference to `nc_del_att'
/usr/lib/gcc/x86_64-pc-linux-gnu/6.2.1/../../../../lib/libnetcdf_c++.so: undefined reference to `nc_inq_dimlen'
/usr/lib/gcc/x86_64-pc-linux-gnu/6.2.1/../../../../lib/libnetcdf_c++.so: undefined reference to `nc_put_att_int'
/usr/lib/gcc/x86_64-pc-linux-gnu/6.2.1/../../../../lib/libnetcdf_c++.so: undefined reference to `nc_inq_attid'
/usr/lib/gcc/x86_64-pc-linux-gnu/6.2.1/../../../../lib/libnetcdf_c++.so: undefined reference to `nc_put_att_double'
/usr/lib/gcc/x86_64-pc-linux-gnu/6.2.1/../../../../lib/libnetcdf_c++.so: undefined reference to `nc_rename_var'
/usr/lib/gcc/x86_64-pc-linux-gnu/6.2.1/../../../../lib/libnetcdf_c++.so: undefined reference to `nc_inq_attname'
/usr/lib/gcc/x86_64-pc-linux-gnu/6.2.1/../../../../lib/libnetcdf_c++.so: undefined reference to `nc_close'
/usr/lib/gcc/x86_64-pc-linux-gnu/6.2.1/../../../../lib/libnetcdf_c++.so: undefined reference to `nc_enddef'
/usr/lib/gcc/x86_64-pc-linux-gnu/6.2.1/../../../../lib/libnetcdf_c++.so: undefined reference to `nc_inq_varname'
/usr/lib/gcc/x86_64-pc-linux-gnu/6.2.1/../../../../lib/libnetcdf_c++.so: undefined reference to `nc_get_att_double'
/usr/lib/gcc/x86_64-pc-linux-gnu/6.2.1/../../../../lib/libnetcdf_c++.so: undefined reference to `nc_inq_format'
/usr/lib/gcc/x86_64-pc-linux-gnu/6.2.1/../../../../lib/libnetcdf_c++.so: undefined reference to `nc_inq_varndims'
/usr/lib/gcc/x86_64-pc-linux-gnu/6.2.1/../../../../lib/libnetcdf_c++.so: undefined reference to `nc_inq_dimname'
/usr/lib/gcc/x86_64-pc-linux-gnu/6.2.1/../../../../lib/libnetcdf_c++.so: undefined reference to `nc_inq_nvars'
/usr/lib/gcc/x86_64-pc-linux-gnu/6.2.1/../../../../lib/libnetcdf_c++.so: undefined reference to `nc_get_att_float'
/usr/lib/gcc/x86_64-pc-linux-gnu/6.2.1/../../../../lib/libnetcdf_c++.so: undefined reference to `nc_sync'
/usr/lib/gcc/x86_64-pc-linux-gnu/6.2.1/../../../../lib/libnetcdf_c++.so: undefined reference to `nc_put_vara_schar'
/usr/lib/gcc/x86_64-pc-linux-gnu/6.2.1/../../../../lib/libnetcdf_c++.so: undefined reference to `nc_get_att_text'
/usr/lib/gcc/x86_64-pc-linux-gnu/6.2.1/../../../../lib/libnetcdf_c++.so: undefined reference to `nc_set_fill'
/usr/lib/gcc/x86_64-pc-linux-gnu/6.2.1/../../../../lib/libnetcdf_c++.so: undefined reference to `nc_put_vara_double'
/usr/lib/gcc/x86_64-pc-linux-gnu/6.2.1/../../../../lib/libnetcdf_c++.so: undefined reference to `nc_get_vara_long'
/usr/lib/gcc/x86_64-pc-linux-gnu/6.2.1/../../../../lib/libnetcdf_c++.so: undefined reference to `nc_rename_dim'
/usr/lib/gcc/x86_64-pc-linux-gnu/6.2.1/../../../../lib/libnetcdf_c++.so: undefined reference to `nc__create'
/usr/lib/gcc/x86_64-pc-linux-gnu/6.2.1/../../../../lib/libnetcdf_c++.so: undefined reference to `nc_put_att_short'
/usr/lib/gcc/x86_64-pc-linux-gnu/6.2.1/../../../../lib/libnetcdf_c++.so: undefined reference to `nc_put_att_long'
/usr/lib/gcc/x86_64-pc-linux-gnu/6.2.1/../../../../lib/libnetcdf_c++.so: undefined reference to `nc_put_vara_text'
/usr/lib/gcc/x86_64-pc-linux-gnu/6.2.1/../../../../lib/libnetcdf_c++.so: undefined reference to `nc_inq_var'
/usr/lib/gcc/x86_64-pc-linux-gnu/6.2.1/../../../../lib/libnetcdf_c++.so: undefined reference to `nc_get_vara_int'
/usr/lib/gcc/x86_64-pc-linux-gnu/6.2.1/../../../../lib/libnetcdf_c++.so: undefined reference to `nc_get_vara_float'
/usr/lib/gcc/x86_64-pc-linux-gnu/6.2.1/../../../../lib/libnetcdf_c++.so: undefined reference to `nc_put_att_text'
/usr/lib/gcc/x86_64-pc-linux-gnu/6.2.1/../../../../lib/libnetcdf_c++.so: undefined reference to `nc_put_vara_short'
/usr/lib/gcc/x86_64-pc-linux-gnu/6.2.1/../../../../lib/libnetcdf_c++.so: undefined reference to `nc_def_var'
/usr/lib/gcc/x86_64-pc-linux-gnu/6.2.1/../../../../lib/libnetcdf_c++.so: undefined reference to `nc_put_vara_long'
/usr/lib/gcc/x86_64-pc-linux-gnu/6.2.1/../../../../lib/libnetcdf_c++.so: undefined reference to `nc_get_att_int'
/usr/lib/gcc/x86_64-pc-linux-gnu/6.2.1/../../../../lib/libnetcdf_c++.so: undefined reference to `nc_rename_att'
/usr/lib/gcc/x86_64-pc-linux-gnu/6.2.1/../../../../lib/libnetcdf_c++.so: undefined reference to `nc_get_vara_double'
/usr/lib/gcc/x86_64-pc-linux-gnu/6.2.1/../../../../lib/libnetcdf_c++.so: undefined reference to `nc_put_att_float'
/usr/lib/gcc/x86_64-pc-linux-gnu/6.2.1/../../../../lib/libnetcdf_c++.so: undefined reference to `nc_inq_varid'
/usr/lib/gcc/x86_64-pc-linux-gnu/6.2.1/../../../../lib/libnetcdf_c++.so: undefined reference to `nc_strerror'
/usr/lib/gcc/x86_64-pc-linux-gnu/6.2.1/../../../../lib/libnetcdf_c++.so: undefined reference to `nc_put_vara_int'
/usr/lib/gcc/x86_64-pc-linux-gnu/6.2.1/../../../../lib/libnetcdf_c++.so: undefined reference to `nc_inq_varnatts'
/usr/lib/gcc/x86_64-pc-linux-gnu/6.2.1/../../../../lib/libnetcdf_c++.so: undefined reference to `nc_get_vara_text'
/usr/lib/gcc/x86_64-pc-linux-gnu/6.2.1/../../../../lib/libnetcdf_c++.so: undefined reference to `nc_inq_vartype'
/usr/lib/gcc/x86_64-pc-linux-gnu/6.2.1/../../../../lib/libnetcdf_c++.so: undefined reference to `nc__open'
/usr/lib/gcc/x86_64-pc-linux-gnu/6.2.1/../../../../lib/libnetcdf_c++.so: undefined reference to `nc_get_att_schar'
collect2: error: ld returned 1 exit status
make[2]: *** [src/PottF/CMakeFiles/PottF.dir/build.make:284: bin/PottF] Error 1
make[1]: *** [CMakeFiles/Makefile2:2956: src/PottF/CMakeFiles/PottF.dir/all] Error 2
make: *** [Makefile:161: all] Error 2
==> ERROR: A failure occurred in build().
Aborting...

pezzacolori commented on 2016-11-17 13:21

please add dependency to "emos"