Package Details: mgetty 1.2.1-1

Git Clone URL: https://aur.archlinux.org/mgetty.git (read-only, click to copy)
Package Base: mgetty
Description: Mgetty is a versatile program to handle all aspects of a modem under Unix.
Upstream URL: http://mgetty.greenie.net/
Licenses: GPL
Submitter: XavierCLL
Maintainer: alexei
Last Packager: alexei
Votes: 6
Popularity: 0.000000
First Submitted: 2009-11-12 15:51 (UTC)
Last Updated: 2021-03-25 21:18 (UTC)

Latest Comments

utiac commented on 2021-03-26 13:16 (UTC)

@alexei - thank you very much It builds and works for my purposes. (with limited testing) Will report back here if I notice anything odd.

alexei commented on 2021-03-25 21:19 (UTC)

@utiac: pushed fix (untested), thanks for the report.

utiac commented on 2021-03-24 16:56 (UTC) (edited on 2021-03-24 18:27 (UTC) by utiac)

Error running makepkg on mgetty. log is here: https://drive.google.com/file/d/10ZOgijB5fuZpwm6msx4Z9fV5TMKancWm/view?usp=sharing

alexei commented on 2018-01-14 04:36 (UTC)

@oberon2007, @effeffe: fixed.

oberon2007 commented on 2016-08-01 18:44 (UTC) (edited on 2016-08-01 18:45 (UTC) by oberon2007)

The source was moved to http://fossies.org/linux/misc/old/mgetty1.1.37-Jun05.tar.gz !

effeffe commented on 2016-02-03 18:01 (UTC)

Also I get an error, please fix! http://pastebin.com/EpUQRieK

aligator commented on 2016-01-14 17:01 (UTC)

I get an error: https://bpaste.net/show/999894c26e73

deons commented on 2014-11-23 12:34 (UTC)

Hi petterk, Problems are now fixed. Please let me know if you are still having problems.

neTpK commented on 2014-11-23 09:32 (UTC)

mgetty /etc/ mgetty /etc/rc.d/ mgetty /etc/rc.d/faxrunqd mgetty /etc/udev/ mgetty /etc/udev/rules.d/ mgetty /etc/udev/rules.d/90-mgetty.rules No binaries..?

neTpK commented on 2014-11-23 09:17 (UTC)

Successfully installed but: which: no mgetty in (/usr/local/sbin:/usr/local/bin:/usr/bin:/usr/lib/jvm/default/bin:/usr/bin/site_perl:/usr/bin/vendor_perl:/usr/bin/core_perl) Also no /etc/mgetty directory. Where is it..?

XavierCLL commented on 2011-08-29 01:41 (UTC)

@redada I don't know what happen with official server of mgetty, I changed mirror, try again.

commented on 2011-08-28 13:03 (UTC)

Hello, the package is not downloadable. I'd like to set up a Caller-ID script on my server. Any hints? Thanks, redada

XavierCLL commented on 2011-01-06 02:58 (UTC)

Thanks @Dieter please send me patch files for test it. regards

commented on 2011-01-04 21:48 (UTC)

If someone is interested, I modified the PKGBUILD http://aur.pastebin.com/pAe8qvZw for mgetty and added more patches, the faxrunqd daemon and an udev rule to make sendfax install in the "usual" directories and let sendfax really send faxes via /dev/ttySx (set access rights via udev).

drankinatty commented on 2010-10-17 20:08 (UTC)

Current build fails on x86_64: <snip> t_g3f_c.c: In function ‘main’: t_g3f_c.c:53:5: warning: implicit declaration of function ‘getopt’ t_g3f_c.c:69:5: warning: implicit declaration of function ‘fax_init_swaptable’ gcc -o t_g3f_c t_g3f_c.o ../g3file.o ../faxlib.o ../hyla_nsf.o ../modem.o ../io.o run t/t_config... run t/t_ring... run t/t_echo... FAIL: 'echo \c' does not suppress newlines. expected: 'onetwothree' received: 'one\c two\c three' make[1]: *** [test] Error 1 make[1]: Leaving directory `/home/david/arch/pkg/aur/bld/mgetty/src/mgetty-1.1.37/t' make: *** [test] Error 2 Aborting...

XavierCLL commented on 2010-10-17 15:04 (UTC)

Hi @drankinatty, I make patch to fix compile

drankinatty commented on 2010-10-17 06:33 (UTC)

Current build fails on x86_64: <snip> t_g3f_c.c: In function ‘main’: t_g3f_c.c:53:5: warning: implicit declaration of function ‘getopt’ t_g3f_c.c:69:5: warning: implicit declaration of function ‘fax_init_swaptable’ gcc -o t_g3f_c t_g3f_c.o ../g3file.o ../faxlib.o ../hyla_nsf.o ../modem.o ../io.o run t/t_config... run t/t_ring... run t/t_echo... FAIL: 'echo \c' does not suppress newlines. expected: 'onetwothree' received: 'one\c two\c three' make[1]: *** [test] Error 1 make[1]: Leaving directory `/home/david/arch/pkg/aur/bld/mgetty/src/mgetty-1.1.37/t' make: *** [test] Error 2 Aborting...