Package Details: miniconda3 4.7.10-1

Git Clone URL: https://aur.archlinux.org/miniconda3.git (read-only)
Package Base: miniconda3
Description: Mini version of Anaconda Python distribution.
Upstream URL: https://conda.io/en/latest/miniconda.html
Keywords: anaconda conda python
Licenses: custom
Submitter: jadelord
Maintainer: jadelord
Last Packager: jadelord
Votes: 16
Popularity: 1.111072
First Submitted: 2018-06-02 04:06
Last Updated: 2019-08-01 15:22

Latest Comments

1 2 Next › Last »

jadelord commented on 2019-08-02 09:26

This package simply follows the pkgbuild of anaconda in AUR (https://aur.archlinux.org/packages/anaconda/). Heads up: users are discouraged to install miniconda3 as an AUR package as there is no official howto on packaging it in linux distros (https://github.com/conda/conda/issues/1235). You may be better served as just running:

curl -LO <https://repo.continuum.io/miniconda/Miniconda3-latest-Linux-x86_64.sh>
bash Miniconda3-latest-Linux-x86_64.sh -p /path/to/miniconda

lerhard commented on 2019-08-01 18:57

I cannot install the package due to:

==> Starting package()... -> Packaging miniconda3 for installation to /opt/miniconda3 PREFIX=/home/lukas/.cache/yay/miniconda3/pkg/miniconda3/opt/miniconda3 Unpacking payload ... [5169] mod is NULL - structTraceback (most recent call last): File "/spare/local/nwani/pyinstaller_stuff/dev/lib/python3.6/struct.py", line 13, in <module> ModuleNotFoundError: No module named '_struct' [5169] mod is NULL - pyimod02_archiveTraceback (most recent call last): File "/spare/local/nwani/pyinstaller_stuff/dev/lib/python3.6/site-packages/PyInstaller/loader/pyimod02_archive.py", line 28, in <module> ModuleNotFoundError: No module named 'struct' [5169] mod is NULL - pyimod03_importersTraceback (most recent call last): File "/spare/local/nwani/pyinstaller_stuff/dev/lib/python3.6/site-packages/PyInstaller/loader/pyimod03_importers.py", line 24, in <module> ModuleNotFoundError: No module named 'pyimod02_archive' Traceback (most recent call last): File "site-packages/PyInstaller/loader/pyiboot01_bootstrap.py", line 15, in <module> ModuleNotFoundError: No module named 'pyimod03_importers' [5169] Failed to execute script pyiboot01_bootstrap ERROR: could not extract tar starting at offset 000000000000018891+9231072+2 ==> ERROR: A failure occurred in package(). Aborting... Error making: miniconda3

Fenrihr commented on 2019-08-01 14:59

New release: 4.7.10 (2019-07-19). Please update

lerhard commented on 2019-07-22 14:20

hidebu, Thank you ! I looked for hours and can confirm that the symbolik link workaround seems to work.

hidebu commented on 2019-05-22 11:38

jat255, I face the same issue, and solved it by overwriting ld in compailer_compat. e.g. ln -snf /bin/ld ~/.conda/envs/py365/compiler_compat/ld

it seems binutils 2.32 is required, but ld in compailer_compat is 2.31.1. I found the hint at https://bbs.archlinux.org/viewtopic.php?id=242682

jat255 commented on 2019-02-27 17:53

Has anyone using this package (together with PyCharm) been able to install the Cython debugging extensions in a project that is using a conda environment as the Python interpreter? The extensions compile fine when using the system-wide python, but fail when using miniconda's python. I receive the following error when trying to compile the extensions manually:

$ sudo /path/to/miniconda/python /opt/pycharm-professional/helpers/pydev/setup_cython.py build_ext --inplace

running build_ext
building '_pydevd_bundle.pydevd_cython' extension
creating build/temp.linux-x86_64-3.6
creating build/temp.linux-x86_64-3.6/_pydevd_bundle
gcc -pthread -B /home/xxx/.conda/envs/xxx/compiler_compat -Wl,--sysroot=/ -Wsign-compare -DNDEBUG -g -fwrapv -O3 -Wall -Wstrict-prototypes -fPIC -I/home/xxx/.conda/envs/xxx/include/python3.6m -c _pydevd_bundle/pydevd_cython.c -o build/temp.linux-x86_64-3.6/_pydevd_bundle/pydevd_cython.o
creating build/lib.linux-x86_64-3.6
creating build/lib.linux-x86_64-3.6/_pydevd_bundle
gcc -pthread -shared -B /home/xxx/.conda/envs/xxx/compiler_compat -L/home/xxx/.conda/envs/xxx/lib -Wl,-rpath=/home/xxx/.conda/envs/xxx/lib -Wl,--no-as-needed -Wl,--sysroot=/ build/temp.linux-x86_64-3.6/_pydevd_bundle/pydevd_cython.o -o build/lib.linux-x86_64-3.6/_pydevd_bundle/pydevd_cython.cpython-36m-x86_64-linux-gnu.so
/home/xxx/.conda/envs/xxx/compiler_compat/ld: build/temp.linux-x86_64-3.6/_pydevd_bundle/pydevd_cython.o: unable to initialize decompress status for section .debug_info
/home/xxx/.conda/envs/xxx/compiler_compat/ld: build/temp.linux-x86_64-3.6/_pydevd_bundle/pydevd_cython.o: unable to initialize decompress status for section .debug_info
/home/xxx/.conda/envs/xxx/compiler_compat/ld: build/temp.linux-x86_64-3.6/_pydevd_bundle/pydevd_cython.o: unable to initialize decompress status for section .debug_info
/home/xxx/.conda/envs/xxx/compiler_compat/ld: build/temp.linux-x86_64-3.6/_pydevd_bundle/pydevd_cython.o: unable to initialize decompress status for section .debug_info
build/temp.linux-x86_64-3.6/_pydevd_bundle/pydevd_cython.o: file not recognized: file format not recognized
collect2: error: ld returned 1 exit status
error: command 'gcc' failed with exit status 1

(x-posting this comment to the pycharm-professional AUR page)

jadelord commented on 2018-11-27 10:01

nikatar, I don't think this is related to miniconda3 packaging, so this is not the right support channel. Still, I could give you some directions:

Consider moving / deleting the following directory

~/.ipython/profile_default/

Check your environment variables for remnants from your previous installation.

env | grep conda
env | grep CONDA

nikatar commented on 2018-11-23 15:06

Hello. Could you help me please? At the beginning I installed anaconda from AUR. After I removed it(including files and directories in HOME manually) and installed miniconda, but now I can't run jupyter-notebook due to kernel errors: for some reasons jupyter-notebook tries to run command ~/anoconda3/bin/python

['/home/nikatar/anaconda3/bin/python', '-m', 'ipykernel_launcher', '-f', '/run/user/1000/jupyter/kernel-7cbb9d30-cfc3-4ecd-b067-adbcfb36eb29.json'] PATH='/home/nikatar/.conda/envs/myenv/bin:/home/nikatar/.rvm/gems/ruby-2.5.1/bin:/home/nikatar/.rvm/gems/ruby-2.5.1@global/bin:/home/nikatar/.rvm/rubies/ruby-2.5.1/bin:/usr/local/bin:/usr/bin:/bin:/usr/local/sbin:/usr/lib/jvm/default/bin:/usr/bin/site_perl:/usr/bin/vendor_perl:/usr/bin/core_perl:/home/nikatar/.rvm/bin:/usr/lib/jvm/default/bin:/usr/bin/site_perl:/usr/bin/vendor_perl:/usr/bin/core_perl:/home/nikatar/.rvm/bin' with kwargs: {'stdin': -1, 'stdout': None, 'stderr': None, 'cwd': '/home/nikatar/Документы/dev/omm/1-28', 'start_new_session': True}

jadelord commented on 2018-09-17 11:41

@simonp Done :)

simonp commented on 2018-09-17 11:38

Please use https for downloading MinicondaXXX.sh.