Package Details: monkeysphere 0.44-1

Git Clone URL: https://aur.archlinux.org/monkeysphere.git (read-only, click to copy)
Package Base: monkeysphere
Description: Leverage the OpenPGP web of trust for OpenSSH and Web authentication
Upstream URL: http://web.monkeysphere.info/
Licenses: GPL3
Submitter: fauno
Maintainer: svalo
Last Packager: svalo
Votes: 22
Popularity: 0.43
First Submitted: 2011-01-20 23:39 (UTC)
Last Updated: 2021-10-13 06:55 (UTC)

Latest Comments

1 2 3 4 5 Next › Last »

svalo commented on 2021-10-13 06:20 (UTC) (edited on 2021-10-13 06:58 (UTC) by svalo)

It seems that the website is gone and shows AD content. I'll later check if it's possible to use [1] as a temporary source.

[UPDATE] I changed the source to use debnian archive, archive checksum was the same

[1] http://deb.debian.org/debian/pool/main/m/monkeysphere/monkeysphere_0.44.orig.tar.gz

archelvetic commented on 2021-10-09 10:11 (UTC)

==> Validating source files with sha256sums...
    monkeysphere_0.44.orig.tar.gz ... FAILED
    agent-transfer.patch ... Passed
==> ERROR: One or more files did not pass the validity check!

mariano.martin commented on 2020-11-09 17:04 (UTC)

SSL certificate issue is still ongoing. The source file must be fetched using HTTP instead of HTTPS.

cuihao commented on 2020-05-18 17:37 (UTC)

Failed to download sources because upstream SSL cert has expired:

==> Retrieving sources...
  -> Downloading monkeysphere_0.44.orig.tar.gz...
curl: (60) SSL certificate problem: certificate has expired
More details here: https://curl.haxx.se/docs/sslcerts.html

curl failed to verify the legitimacy of the server and therefore could not
establish a secure connection to it. To learn more about this situation and
how to fix it, please visit the web page mentioned above.

GergelyPolonkai commented on 2018-11-08 08:57 (UTC)

Now it misses Crypt/OpenSSL/Bignum.pm. Maybe extra/perl-crypt-openssl-bignum should be added to the build dependencies; after installing it, monkeysphere also installed successfully!

svalo commented on 2018-10-21 09:16 (UTC)

@mhemeryck: Well actually there wasn't any issue in the build process but rather in the 'check' phase which executed some tests as provided from upstream developers. The tests were not passing and therefore makepackage considered the build failed. You may want to read the PKGBUILD to see which steps are executed in order to build the package

mhemeryck commented on 2018-10-20 20:40 (UTC)

Thanks for the fix! Works now on my local machine.

Just out of curiosity: what was actually the issue in the build process? Seems like it's doing some heavy integration testing, just in the build.

svalo commented on 2018-10-19 13:09 (UTC)

Hi all, sorry, I was not very present. Upstream released a new version and on my box tests are passing, can you please try upgrading/installing now and reporting here?

Thanks

GergelyPolonkai commented on 2018-10-15 08:09 (UTC)

@Ghul: hd is a Debian specific (?) alias for hexdump (at least it doesn’t exist on my Fedora and Gentoo boxes, and man hd opens the hexdump man page on Ubuntu.

This, however, doesn’t solve the diff issue reported by @mhemeryck (which i also have)

mhemeryck commented on 2018-10-08 07:56 (UTC)

Tried doing an install via pikaur; got this issue:

+++ /dev/fd/63  2018-10-08 09:51:07.734374988 +0200
@@ -1,5 +1,5 @@
-pub:u:1024:1:0E41076773CB19F7:1538985067:::u:::scSC
-uid:u::::1538985067::E90EC72E68C6C2A0751DADC70F54F60D27B88C3D::monkeymonkey
-sig:!::1:0E41076773CB19F7:1538985067::::monkeymonkey:13x:::::8
-uid:u::::1538985067::8200BD0425CC70C7D698DF3FE412044EAAB83F94::testtest
-sig:!::1:0E41076773CB19F7:1538985067::::monkeymonkey:13x:::::8
+pub:u:1024:1:0E41076773CB19F7:1538985067:::u:::scSC::::::::0
+uid:u::::1538985067::E90EC72E68C6C2A0751DADC70F54F60D27B88C3D::monkeymonkey::::::::::0
+sig:!::1:0E41076773CB19F7:1538985067::::monkeymonkey:13x::85763FA8731311FE9C1EB3710E41076773CB19F7:::8
+uid:u::::1538985067::8200BD0425CC70C7D698DF3FE412044EAAB83F94::testtest::::::::::0
+sig:!::1:0E41076773CB19F7:1538985067::::monkeymonkey:13x::85763FA8731311FE9C1EB3710E41076773CB19F7:::8
FAILED!
### removing temp dir...
make: *** [Makefile:117: test-keytrans] Error 1
==> ERROR: A failure occurred in check().
    Aborting...

Command 'makepkg --force' failed to execute.

I am guessing it tries to import a test in the build process, but notices something different? The keys look pretty similar, apart for some trailing stuff: ::::::::::0