Package Details: monteverdi2 3.2.0-1

Git Clone URL: (read-only)
Package Base: monteverdi2
Description: A remote sensing application based on Orfeo Toolbox
Upstream URL:
Licenses: CeCILL
Provides: monteverdi2
Submitter: ArArgyridis
Maintainer: ArArgyridis
Last Packager: ArArgyridis
Votes: 4
Popularity: 0.000000
First Submitted: 2014-07-02 08:31
Last Updated: 2016-05-24 07:36

Dependencies (2)

Required by (0)

Sources (1)

Latest Comments

kikislater commented on 2016-05-24 21:56

error with otb-ice :

CMake Error at /usr/lib/cmake/OTB-5.4/OTBModuleAPI.cmake:51 (message):
No such module: "OTBIce"
Call Stack (most recent call first):
/usr/lib/cmake/OTB-5.4/OTBModuleAPI.cmake:26 (otb_module_load)
/usr/lib/cmake/OTB-5.4/OTBModuleAPI.cmake:70 (_otb_module_config_recurse)
/usr/lib64/cmake/OTB-5.4/OTBConfig.cmake:65 (otb_module_config)
CMakeLists.txt:93 (find_package)

-- Configuring incomplete, errors occurred!
See also "/tmp/yaourt-tmp-kiki/aur-monteverdi2/src/build/CMakeFiles/CMakeOutput.log".
==> ERREUR : Une erreur s’est produite dans build().
==> ERREUR : Makepkg n'a pas pu construire monteverdi2.
==> Relancer la compilation de monteverdi2 ? [o/N]

kikislater commented on 2016-05-23 21:10

ok with orfeo-toolbox but not with monteverdi :

==> Extraction des sources...
-> Création d’une copie de travail du dépot Monteverdi2 git...
Clonage dans 'monteverdi2'...
Basculement sur la nouvelle branche 'makepkg'
==> Lancement de build()...
==> starting make...
/tmp/yaourt-tmp-kiki/aur-monteverdi2/./PKGBUILD: ligne 42 : cd: build: Aucun fichier ou dossier de ce type
==> ERREUR : Une erreur s’est produite dans build().

ArArgyridis commented on 2016-05-23 17:32

Well you don't need anymore otb-ice, as orfeo toolbox has it already inside it. I have updated both PKGBUILDs and they should be working ok. If you have any troubles please notify me :)

kikislater commented on 2016-05-23 14:16

OTB last revision : 5.4.0 This version is a major version with corrected bugs and enhancements ... (oh ! Ok, you upgrade it, thank you)
I made a new PKGBUILD : watch comments =>
I built also otb-ice 0.4
I tried also with monteverdi las revision 3.2 but no success, I 've got an error that otb-ice is not found. All packages are here now :

ArArgyridis commented on 2016-05-23 14:00

I updated the PKGBUILD, however I also get the same error. Which version of OTB do you use?

kikislater commented on 2016-05-22 16:11

Please update

curl: (22) The requested URL returned error: 404 Not Found
==> ERREUR : Erreur lors du téléchargement de

geosam commented on 2016-05-20 18:54

I get the next error:

[ 14%] Building CXX object Code/Common/Core/CMakeFiles/Monteverdi2_Core.dir/mvdQuicklookModel.cxx.o
[ 15%] Building CXX object Code/Common/Core/CMakeFiles/Monteverdi2_Core.dir/mvdSerializableInterface.cxx.o
[ 15%] Building CXX object Code/Common/Core/CMakeFiles/Monteverdi2_Core.dir/mvdTextStream.cxx.o
[ 15%] Building CXX object Code/Common/Core/CMakeFiles/Monteverdi2_Core.dir/mvdTypes.cxx.o
[ 16%] Building CXX object Code/Common/Core/CMakeFiles/Monteverdi2_Core.dir/mvdVectorImageModel.cxx.o
[ 16%] Building CXX object Code/Common/Core/CMakeFiles/Monteverdi2_Core.dir/moc_mvdAbstractImageModel.cxx.o
/home/samtux/makepkg/monteverdi2/src/Monteverdi2-0.8.1/Code/Common/Core/mvdVectorImageModel.cxx: En la función miembro ‘void mvd::VectorImageModel::BuildGdalOverviews()’:
/home/samtux/makepkg/monteverdi2/src/Monteverdi2-0.8.1/Code/Common/Core/mvdVectorImageModel.cxx:256:31: error: ‘AVERAGE’ no es un miembro de ‘otb’
/home/samtux/makepkg/monteverdi2/src/Monteverdi2-0.8.1/Code/Common/Core/mvdVectorImageModel.cxx:261:11: error: ‘itk::SmartPointer<otb::GDALOverviewsBuilder>::ObjectType {aka class otb::GDALOverviewsBuilder}’ has no member named ‘SetNbOfResolutions’; did you mean ‘SetNbResolutions’?
Code/Common/Core/CMakeFiles/Monteverdi2_Core.dir/build.make:641: fallo en las instrucciones para el objetivo 'Code/Common/Core/CMakeFiles/Monteverdi2_Core.dir/mvdVectorImageModel.cxx.o'
make[2]: *** [Code/Common/Core/CMakeFiles/Monteverdi2_Core.dir/mvdVectorImageModel.cxx.o] Error 1
make[2]: *** Se espera a que terminen otras tareas....
CMakeFiles/Makefile2:130: fallo en las instrucciones para el objetivo 'Code/Common/Core/CMakeFiles/Monteverdi2_Core.dir/all'
make[1]: *** [Code/Common/Core/CMakeFiles/Monteverdi2_Core.dir/all] Error 2
Makefile:127: fallo en las instrucciones para el objetivo 'all'
make: *** [all] Error 2
==> ERROR: Se produjo un fallo en build().

ArArgyridis commented on 2015-04-21 09:16

Now orfeo toolbox is builted with itk4.5 so monteverdi2 does not need itk4.5 as depedency. Thank you for your help!

geosam commented on 2015-04-12 13:52

The correct PKGBUILD with ITK dependency:

geosam commented on 2015-04-09 03:11

Require dependency ITK

All comments