Package Details: mprime-bin 303b6-1

Git Clone URL: https://aur.archlinux.org/mprime-bin.git (read-only, click to copy)
Package Base: mprime-bin
Description: A GIMPS, distributed computing project client, dedicated to finding Mersenne primes. Precompiled binary version.
Upstream URL: http://www.mersenne.org
Licenses: custom
Conflicts: mprime
Provides: mprime
Submitter: graysky
Maintainer: graysky
Last Packager: graysky
Votes: 106
Popularity: 0.015700
First Submitted: 2012-01-22 12:11
Last Updated: 2020-10-04 19:31

Latest Comments

« First ‹ Previous 1 2 3 4 5 Next › Last »

kfgz commented on 2013-12-08 11:19

Graysky, fix the license.txt file issue. Please.

felixonmars commented on 2013-12-08 02:20

But I'm building for x86_64 :3

graysky commented on 2013-12-07 17:10

@felix - When I try to build i686, the errors are deeper than that:
==> Starting build()...
...
gcc -I.. -I../gwnum -O2 -march=i486 -malign-double -Wno-unused-result -c menu.c
In file included from prime.h:92:0,
from prime.c:6:
../commonb.h:11:22: fatal error: security.h: No such file or directory
#include "security.h"
^
compilation terminated.
makefile:37: recipe for target 'prime.o' failed
make: *** [prime.o] Error 1
make: *** Waiting for unfinished jobs....
In file included from prime.h:92:0,
from menu.c:7:
../commonb.h:11:22: fatal error: security.h: No such file or directory
#include "security.h"
^
compilation terminated.
[ ! -e ../security.c ] && touch ../security.c || true
makefile:37: recipe for target 'menu.o' failed
make: *** [menu.o] Error 1
[ ! -e ../secure5.c ] && touch ../secure5.c || true
==> ERROR: A failure occurred in build().

felixonmars commented on 2013-12-07 16:28

Missing license.txt failed package() here:

==> Starting package()...
install: cannot stat ‘license.txt’: No such file or directory
==> ERROR: A failure occurred in package().

graysky commented on 2013-12-07 12:04

You are right... I can't get it to build for i686 either. I will remove that arch from the package. Users of i686 should use the mprime-bin package (precompiled by upstream).

yar commented on 2013-12-07 00:55

Works in a clean x86_64 chroot. However, on a clean i686 chroot I am getting the exact same error as @Gooberslot. Perhaps there's a dependency missing?

Anonymous comment on 2013-07-05 12:52

(accidently I deleted my previous comment, sorry about that)
@graysky: thanks, i'll try to build in clean chroot

graysky commented on 2013-07-05 12:04

Dunno what to tell you guys. Builds for me in a clean chroot[1]. Are you sure you have both base and base-devel installed? These are prerequists for building in the AUR[2].

1. https://gist.github.com/graysky2/5934081
2. https://wiki.archlinux.org/index.php/AUR#Prerequisites and https://wiki.archlinux.org/index.php/AUR#Q:_Foo_in_AUR_does_not_compile_when_I_run_makepkg.3B_what_should_I_do.3F

graysky commented on 2013-03-28 22:15

...Why out-of-date, anonymous_user?

graysky commented on 2013-03-28 22:14

...why out-of-date, anonymous_user?