Package Details: nethack-qt 3.4.3-1

Git Clone URL: https://aur.archlinux.org/nethack-qt.git (read-only)
Package Base: nethack-qt
Description: A single player dungeon exploration game
Upstream URL: http://www.nethack.org/index.html
Licenses: custom
Submitter: None
Maintainer: None
Last Packager: boustrophedon
Votes: 4
Popularity: 0.000000
First Submitted: 2008-10-02 11:28
Last Updated: 2015-06-28 23:18

Latest Comments

boustrophedon commented on 2014-08-02 16:37

This is the official version from the DevTeam compiled with the qt flags and such. It would be awesome if you packaged and released that as nethack-qt4 or something, though!

WFCody commented on 2014-08-02 13:08

There is a Qt4 port here:

https://gitorious.org/nethack-qt

boustrophedon commented on 2014-01-18 05:55

This is the first aur package I've adopted, but using the below fixes and taking cues from the official nethack package, I bundled everything into a patch, and the current build works for me.

Anonymous comment on 2012-10-22 07:45

I'm having the same trouble as morion.

der_ronny commented on 2012-06-22 09:34

Is there a reason why /usr/share/nethack-qt/nethack-qt has SUID set????

Anonymous comment on 2011-01-30 15:47

i'm install "moc" and cp it to /bin/ directory, but now get another error:

g++ -D__CORRECT_ISO_CPP_STRINGS_H_PROTO -O -I../include -I. -I/include -c ../win/Qt/qt_win.cpp
In file included from ../win/Qt/qt_win.cpp:77:0:
../include/qt_win.h:19:21: fatal error: qdialog.h: No such file or directory
compilation terminated.
make[1]: *** [qt_win.o] Error 1

help me plz))

Anonymous comment on 2010-09-29 02:28

Build Failed, I get this:


cc -D__CORRECT_ISO_CPP_STRINGS_H_PROTO -O -I../include -o tilemap ../win/share/tilemap.c
./tilemap
make[2]: Leaving directory `/tmp/clyde-x1r1/nethack-qt/nethack-qt/src/nethack-3.4.3/util'
cc -D__CORRECT_ISO_CPP_STRINGS_H_PROTO -O -I../include -c -o tile.o tile.c
/bin/moc -o qt_win.moc ../include/qt_win.h
make[1]: /bin/moc: Command not found
make[1]: *** [qt_win.moc] Error 127
make[1]: Leaving directory `/tmp/clyde-x1r1/nethack-qt/nethack-qt/src/nethack-3.4.3/src'
make: *** [nethack-qt] Error 2
Aborting...
error: Build failed

any ideas?

pinklerose commented on 2010-06-10 13:45

@elvaka
Could you explain step by step how to do it?

pinklerose commented on 2010-06-10 13:42

@elvaka
Could you explain step by step how to do it?

Anonymous comment on 2010-06-05 23:46

It doesn't build with gcc 4.5, it needs the flag __CORRECT_ISO_CPP_STRINGS_H_PROTO

You can fix it adding this quick and ugly sed before running "sh sys/unix/setup.sh":

sed -e 's|CFLAGS = -O|CFLAGS = -D__CORRECT_ISO_CPP_STRINGS_H_PROTO -O|' \
-i ${srcdir}/${_pkgname}-${pkgver}/sys/unix/Makefile.* || return 1