Package Details: nightingale-git 78bd501-1

Git Clone URL: https://aur.archlinux.org/nightingale-git.git (read-only)
Package Base: nightingale-git
Description: Open source fork of the Songbird Media Player. Uses prebuilt xulrunner and sqlite.
Upstream URL: http://getnightingale.com/
Licenses: GPL2, BSD, MPL
Conflicts: nightingale
Provides: nightingale
Submitter: ilikenwf
Maintainer: ilikenwf
Last Packager: ilikenwf
Votes: 33
Popularity: 0.000001
First Submitted: 2011-09-27 15:44
Last Updated: 2016-06-19 04:11

Latest Comments

1 2 3 4 5 6 ... Next › Last »

Det commented on 2018-02-13 05:01

There's no nightingale-bin for http://getnightingale.com/all-versions.php?

E: It's because the latest release was so long ago?: https://github.com/nightingale-media-player/nightingale-hacking/releases

x86vk commented on 2017-12-19 08:03

If you are facing with the "-fno-plt" error, just edit your /etc/makepkg.conf and remove the "-fno-plt" flag from CFLAGS and CXXFLAGS. You can add it back after having this package installed.

Xeno_Idaltu commented on 2017-12-15 09:12

-Problem with the building of this package.

1) I installed gcc5 and libgnomeui separately since they took almost three hours to finish.

2) With all dependencies installed, I proceed with Nightingale:

I get this error at the end.

==> ERROR: Makepkg was unable to build nightingale-git.

JohnRobson commented on 2017-08-07 21:21

make[6]: Entering directory '/var/cache/pacman/makepkg/nightingale-git/src/nightingale-hacking/compiled/components/moz/strings/src'
CXX tier_componentsbase
g++-5: error: unrecognized command line option ‘-fno-plt’
[g++-5 (GCC) 5.4.0]

ilikenwf commented on 2016-07-31 18:18

Did you try it with American English on your own build?

I haven't rebuilt in a while but using gcc5 is imperative.

kaipee commented on 2016-07-31 15:47

UPDATE: there seems to be a problem with the building of this package. Downloading the official (pre-built) packages cause no issues whatsoever, so far. I've tested all versions (32/64bit and standard Linux/Gnome integration) and they all run file, although they seem to not like British English as language.

https://getnightingale.com/all-versions.php

kaipee commented on 2016-07-31 15:23

Nightingale seems to immediately crash once 'focussed' / clicked on. Crash and coredump everytime.

/opt/nightingale/nightingale

(process:20944): GLib-CRITICAL **: g_slice_set_config: assertion 'sys_page_size == 0' failed

(nightingale-bin:20944): Gdk-WARNING **: gdk_window_set_icon_list: icons too large

(nightingale-bin:20944): Gdk-WARNING **: gdk_window_set_icon_list: icons too large

(nightingale-bin:20944): Gdk-WARNING **: gdk_window_set_icon_list: icons too large
/opt/nightingale/nightingale: line 146: 20944 Segmentation fault (core dumped) "$prog" ${1+"$@"}

ilikenwf commented on 2016-06-17 05:57

Ok, so gcc5 mostly fixed it, but for whatever reason, the sqlite dependency will build fine, but xulr now does not (what in Arch has changed other than gcc enough to cause this???). At the end of the build, the compiled files aren't accessible and won't execute properly.

As a result, gcc5 and the use of the binary dependency prebuilts from our (nightingale's) downloads area are being used again until we can either find why these won't build anymore, or something else changes.

If anyone can tell me why we get "permission denied" errors unless we're root for building (or possibly outside of makepkg?) and how to fix, that'd be great so we can go back to non blob builds.

ilikenwf commented on 2016-06-16 13:40

@JohnRobson I think I need to make gcc5 a build dependency and set the mozconfig to use it. You can wait until I do, or try it, but I know mozilla doesn't built with gcc6.

JohnRobson commented on 2016-06-16 05:34

make[5]: *** [/tmp/yaourt-tmp-us/aur-nightingale-git/src/nightingale-deps/xulrunner-1.9.2/mozilla/config/rules.mk:1399: file_util.o] Error 1
make[5]: *** Waiting for unfinished jobs....
/tmp/yaourt-tmp-us/aur-nightingale-git/src/nightingale-deps/xulrunner-1.9.2/mozilla/ipc/chromium/src/base/logging.cc: In destructor ‘mozilla::Logger::~Logger()’:
/tmp/yaourt-tmp-us/aur-nightingale-git/src/nightingale-deps/xulrunner-1.9.2/mozilla/ipc/chromium/src/base/logging.cc:18:20: warning: variable ‘prlevel’ set but not used [-Wunused-but-set-variable]
PRLogModuleLevel prlevel = PR_LOG_DEBUG;
^~~~~~~
In file included from /tmp/yaourt-tmp-us/aur-nightingale-git/src/nightingale-deps/xulrunner-1.9.2/mozilla/ipc/chromium/src/base/lock_impl.h:16:0,
from /tmp/yaourt-tmp-us/aur-nightingale-git/src/nightingale-deps/xulrunner-1.9.2/mozilla/ipc/chromium/src/base/lock.h:8,
from /tmp/yaourt-tmp-us/aur-nightingale-git/src/nightingale-deps/xulrunner-1.9.2/mozilla/ipc/chromium/src/base/histogram.h:38,
from /tmp/yaourt-tmp-us/aur-nightingale-git/src/nightingale-deps/xulrunner-1.9.2/mozilla/ipc/chromium/src/base/message_loop.h:13,
from /tmp/yaourt-tmp-us/aur-nightingale-git/src/nightingale-deps/xulrunner-1.9.2/mozilla/ipc/chromium/src/base/message_loop.cc:5:
/tmp/yaourt-tmp-us/aur-nightingale-git/src/nightingale-deps/xulrunner-1.9.2/mozilla/ipc/chromium/src/base/basictypes.h: In function ‘Dest bit_cast(const Source&)’:
/tmp/yaourt-tmp-us/aur-nightingale-git/src/nightingale-deps/xulrunner-1.9.2/mozilla/ipc/chromium/src/base/basictypes.h:370:16: warning: typedef ‘VerifySizesAreEqual’ locally defined but not used [-Wunused-local-typedefs]
typedef char VerifySizesAreEqual [sizeof(Dest) == sizeof(Source) ? 1 : -1];
^~~~~~~~~~~~~~~~~~~
make[5]: Leaving directory '/tmp/yaourt-tmp-us/aur-nightingale-git/src/nightingale-deps/xulrunner-1.9.2/mozilla/compiled/xulrunner-release/ipc/chromium'
make[4]: *** [/tmp/yaourt-tmp-us/aur-nightingale-git/src/nightingale-deps/xulrunner-1.9.2/mozilla/config/rules.mk:759: libs_tier_xpcom] Error 2
make[4]: Leaving directory '/tmp/yaourt-tmp-us/aur-nightingale-git/src/nightingale-deps/xulrunner-1.9.2/mozilla/compiled/xulrunner-release'
make[3]: *** [/tmp/yaourt-tmp-us/aur-nightingale-git/src/nightingale-deps/xulrunner-1.9.2/mozilla/config/rules.mk:770: tier_xpcom] Error 2
make[3]: Leaving directory '/tmp/yaourt-tmp-us/aur-nightingale-git/src/nightingale-deps/xulrunner-1.9.2/mozilla/compiled/xulrunner-release'
make[2]: *** [/tmp/yaourt-tmp-us/aur-nightingale-git/src/nightingale-deps/xulrunner-1.9.2/mozilla/config/rules.mk:720: default] Error 2
make[2]: Leaving directory '/tmp/yaourt-tmp-us/aur-nightingale-git/src/nightingale-deps/xulrunner-1.9.2/mozilla/compiled/xulrunner-release'
make[1]: *** [client.mk:356: build] Error 2
make[1]: Leaving directory '/tmp/yaourt-tmp-us/aur-nightingale-git/src/nightingale-deps/xulrunner-1.9.2/mozilla'
make: *** [Makefile.songbird:130: xr-build-release] Error 2
make: Leaving directory '/tmp/yaourt-tmp-us/aur-nightingale-git/src/nightingale-deps/xulrunner-1.9.2'
==> ERROR: A failure occurred in build().
Aborting...
==> ERROR: Makepkg was unable to build nightingale-git.