Package Details: nixnote2-git 2.1.6.r4.g460aec81-1

Git Clone URL: https://aur.archlinux.org/nixnote2-git.git (read-only, click to copy)
Package Base: nixnote2-git
Description: Evernote clone (formerly Nevernote) - git checkout
Upstream URL: https://github.com/robert7/nixnote2
Keywords: evernote nixnote notes
Licenses: GPL3
Provides: nixnote, nixnote2
Replaces: nevernote, nixnote, nixnote-beta
Submitter: twa022
Maintainer: Ataraxy
Last Packager: Ataraxy
Votes: 11
Popularity: 0.76
First Submitted: 2017-09-02 16:02 (UTC)
Last Updated: 2022-01-28 14:15 (UTC)

Dependencies (10)

Required by (0)

Sources (2)

Pinned Comments

Ataraxy commented on 2022-01-28 14:12 (UTC)

For faster builds, I suggest you use ccache.

Latest Comments

muflone commented on 2022-07-31 14:43 (UTC)

@xavierbaez

the package builds fine in a clean chroot, so if you have issues use devtools to build this package. the PKGBUILD works fine

xavierbaez commented on 2022-07-11 17:46 (UTC)

When I download and try makepkg -si

These are the errors: ll-1.7 /usr/lib/libQt5PrintSupport.so /usr/lib/libQt5WebKitWidgets.so /usr/lib/libQt5Widgets.so /usr/lib/libQt5WebKit.so /usr/lib/libQt5Gui.so /usr/lib/libQt5Qml.so /usr/lib/libQt5Network.so /usr/lib/libQt5Sql.so /usr/lib/libQt5Xml.so /usr/lib/libQt5DBus.so /usr/lib/libQt5Core.so -lGL -lpthread /usr/bin/ld: /usr/lib/libQt5WebKit.so: undefined reference to std::condition_variable::wait(std::unique_lock<std::mutex>&)@GLIBCXX_3.4.30' /usr/bin/ld: /usr/lib/gcc/x86_64-pc-linux-gnu/9.5.0/../../../../lib/libpoppler-qt5.so: undefined reference tostd::__glibcxx_assert_fail(char const, int, char const, char const)@GLIBCXX_3.4.30' /usr/bin/ld: /usr/lib/libQt5Core.so: undefined reference to std::__exception_ptr::exception_ptr::_M_release()@CXXABI_1.3.13' /usr/bin/ld: /usr/lib/gcc/x86_64-pc-linux-gnu/9.5.0/../../../../lib/libpoppler-qt5.so: undefined reference tostd::__throw_bad_array_new_length()@GLIBCXX_3.4.29' /usr/bin/ld: /usr/lib/libQt5Core.so: undefined reference to `std::__exception_ptr::exception_ptr::_M_addref()@CXXABI_1.3.13' collect2: error: ld returned 1 exit status make: ** [Makefile:1355: qmake-build-release/nixnote2] Error 1 ==> ERROR: A failure occurred in build(). Aborting...

xavier@  /home/xavier/tmp/nixnote2-git   master ✘ U:✹  makepkg -si

xavierbaez commented on 2022-07-11 17:45 (UTC)

/usr/bin/ld: /usr/lib/libQt5Core.so: undefined reference to std::__exception_ptr::exception_ptr::_M_release()@CXXABI_1.3.13' /usr/bin/ld: /usr/lib/gcc/x86_64-pc-linux-gnu/9.5.0/../../../../lib/libpoppler-qt5.so: undefined reference tostd::__throw_bad_array_new_length()@GLIBCXX_3.4.29' /usr/bin/ld: /usr/lib/libQt5Core.so: undefined reference to `std::__exception_ptr::exception_ptr::_M_addref()@CXXABI_1.3.13' collect2: error: ld returned 1 exit status make: *** [Makefile:1355: qmake-build-release/nixnote2] Error 1 ==> ERROR: A failure occurred in build(). Aborting... -> error making: nixnote2-git

Ataraxy commented on 2022-03-06 10:16 (UTC)

@xavierbaez please read what Flag package out-of-date actually means. A package may not build and not be out-of-date.

I removed my build directory and it built just fine. You may wish to try the same.

xavierbaez commented on 2022-03-01 22:09 (UTC)

/moc_crossmemorymapper.o qmake-build-release/moc_mimereference.o qmake-build-release/moc_nuuid.o qmake-build-release/moc_filewatcher.o qmake-build-release/moc_filewatchermanager.o qmake-build-release/moc_batchimport.o qmake-build-release/moc_exportdata.o qmake-build-release/moc_importdata.o qmake-build-release/moc_importenex.o -g -rdynamic -lpoppler-qt5 -lcurl -ltidy -lhunspell-1.7 /usr/lib/libQt5PrintSupport.so /usr/lib/libQt5WebKitWidgets.so /usr/lib/libQt5Widgets.so /usr/lib/libQt5WebKit.so /usr/lib/libQt5Gui.so /usr/lib/libQt5Qml.so /usr/lib/libQt5Network.so /usr/lib/libQt5Sql.so /usr/lib/libQt5Xml.so /usr/lib/libQt5DBus.so /usr/lib/libQt5Core.so -lGL -lpthread /usr/bin/ld: /usr/lib/libQt5Core.so: undefined reference to std::__exception_ptr::exception_ptr::_M_release()@CXXABI_1.3.13' /usr/bin/ld: /usr/lib/gcc/x86_64-pc-linux-gnu/9.4.0/../../../../lib/libpoppler-qt5.so: undefined reference tostd::__throw_bad_array_new_length()@GLIBCXX_3.4.29' /usr/bin/ld: /usr/lib/libQt5Core.so: undefined reference to `std::__exception_ptr::exception_ptr::_M_addref()@CXXABI_1.3.13' collect2: error: ld returned 1 exit status make: *** [Makefile:1383: qmake-build-release/nixnote2] Error 1 ==> ERROR: A failure occurred in build(). Aborting... -> error making: nixnote2-git

xavierbaez commented on 2022-02-25 00:18 (UTC)

It's not compiling anymore.

:: Running post-transaction hooks... (1/1) Arming ConditionNeedsUpdate... -> error making: nixnote2-gi

Ataraxy commented on 2022-01-28 14:12 (UTC)

For faster builds, I suggest you use ccache.

desaparecido commented on 2020-11-08 17:56 (UTC)

hi bing2020, to install from AUR, the basic way is download the PKGBUILD (ex: yay -G nixnote2-git) then go to directory where PKGBUILD is and then

makepkg -sci

read about it in https://wiki.archlinux.org/index.php/Makepkg for all options

when you have a -git package, you need to rebuild to have the latest commits, and if some libs are updated, sometimes is needed rebuild to take the goods libs. I don't use an AUR helper (like yay), but re-install the package surely do a makepkg again. In my case I use chromium like browser.

bing2020 commented on 2020-11-08 15:42 (UTC)

I fixed my problem too. however, I didn't know exactly how i fixed. I did two things in the mean time, 1, used firefox as default browser instead of chromium 2, installed nixnote2 by "yay -S nixnote2", even though i already had it by "yay -S nixnote2-git". I still couldn't log in correctly after these steps, but at some point, i suddenly able to instead of seeing the 418 error or simply no reaction. @desaparecido, how do you rebuild?

desaparecido commented on 2020-11-08 12:05 (UTC)

hi bing2020, I had the same problem, but I re-build the package and after that I had the LOGIN windows, sign-in with google account successfully and after that check to authorize Nixnote to access evernote. Probably is about some updated libs, I don't know, but works for me (I use KDE desktop and testing repo)

bing2020 commented on 2020-11-06 13:49 (UTC) (edited on 2020-11-06 13:52 (UTC) by bing2020)

using the nixnote2-git client on archlinux, click the sync button, a webpage-like window pops up let me log into evernote account.However, CAN NOT LOG IN! when i use chromium as default browser, after fill my email address, click the "continue" button gives no reaction, also no reaction clicking "continue with google" and "continue with apple", after change default browser to firefox, after quite many clicks, it gives me error: HTTP Error 418 Failed to load URL https://www.evernote.com/Login.action. Any one have solution? Thanks

Ataraxy commented on 2020-07-02 12:49 (UTC) (edited on 2020-07-02 12:51 (UTC) by Ataraxy)

Patch updated - thanks for the input. All now builds fine.

I'm looking for a co-maintainer who has a basic working knowledge of git. Please be in touch if you're willing to help out - I'm willing to mentor you if it's your first time.

BlubdiBlub20 commented on 2020-05-20 08:40 (UTC)

This is the patch I needed to build the project in version 2.1.6.r1.gaa5cfeb8. Just update the patch and the checksum in the PKGBUILD file.

From 43769c4bf14d46c4d17c6753a5c3bcc5bb1c944c Mon Sep 17 00:00:00 2001
From: =?UTF-8?q?Florian=20We=C3=9Fel?= <florianwessel@gmx.net>
Date: Wed, 20 May 2020 10:29:11 +0200
Subject: [PATCH] Fix tidy include

---
 src/html/enmlformatter.cpp | 6 +++---
 src/main.cpp               | 4 ++--
 2 files changed, 5 insertions(+), 5 deletions(-)

diff --git a/src/html/enmlformatter.cpp b/src/html/enmlformatter.cpp
index 155db97d..33ad0fac 100644
--- a/src/html/enmlformatter.cpp
+++ b/src/html/enmlformatter.cpp
@@ -38,8 +38,8 @@ Foundation, Inc., 51 Franklin Street, Fifth Floor, Boston, MA  02110-1301, USA.
 #include <tidy.h>
 #include <tidybuffio.h>
 #else
-#include <tidy/tidy.h>
-#include <tidy/tidybuffio.h>
+#include <tidy.h>
+#include <tidybuffio.h>
 #endif

 #define ENML_MODULE_LOGPREFIX "enml-cleanup: "
@@ -916,4 +916,4 @@ bool EnmlFormatter::isFormattingError() const {
 void EnmlFormatter::setContent(QString &contentStr) {
     this->content.clear();
     this->content.append(contentStr.toUtf8());
-}
\ No newline at end of file
+}
diff --git a/src/main.cpp b/src/main.cpp
index c3d5035e..a31ad49c 100644
--- a/src/main.cpp
+++ b/src/main.cpp
@@ -50,8 +50,8 @@ Foundation, Inc., 51 Franklin Street, Fifth Floor, Boston, MA  02110-1301, USA.
 #include <tidy.h>
 #include <tidybuffio.h>
 #else
-#include <tidy/tidy.h>
-#include <tidy/tidybuffio.h>
+#include <tidy.h>
+#include <tidybuffio.h>
 #endif


-- 
2.26.2

robert7 commented on 2020-05-14 14:15 (UTC)

@Ataraxy can you pls adapt the patch?

miguelmsoler commented on 2020-05-14 14:08 (UTC) (edited on 2020-05-14 14:13 (UTC) by miguelmsoler)

Hi, I don't know how to fork the repo for the patck, so I'm pasting an update here. You have to update the sha256 checksum too or change it to SKIP in PKGBUILD file.

This is the code for the new tidy-source-dir-location.patch file:

--- b/src/html/enmlformatter.cpp
+++ a/src/html/enmlformatter.cpp
@@ -34,13 +34,8 @@
 #include "src/logger/qslog.h"
 #include "src/utilities/NixnoteStringUtils.h"

-#ifdef Q_OS_MACOS
 #include <tidy.h>
 #include <tidybuffio.h>
-#else
-#include <tidy/tidy.h>
-#include <tidy/tidybuffio.h>
-#endif

 #define ENML_MODULE_LOGPREFIX "enml-cleanup: "

--- b/src/main.cpp
+++ a/src/main.cpp
@@ -46,14 +46,8 @@

 #include "src/application.h"

-#ifdef Q_OS_MACOS
 #include <tidy.h>
 #include <tidybuffio.h>
-#else
-#include <tidy/tidy.h>
-#include <tidy/tidybuffio.h>
-#endif
-

 NixNote *w;

hungryninjah commented on 2020-05-11 05:30 (UTC) (edited on 2020-05-11 05:31 (UTC) by hungryninjah)

I can no longer build this package. I decided to try reinstalling because of the "out of date" warning and because of the recent server problems with nixnote2, and now I am getting this error. The app was working fine before I decided to reinstall.

==> Starting pkgver()... 
==> Updated version: nixnote2-git 2.1.6.r1.gaa5cfeb8-1 
==> Sources are ready. 
==> Making package: nixnote2-git 2.1.6.r1.gaa5cfeb8-1 (Mon 11 May 2020 03:20:36 PM AEST) 
==> Checking runtime dependencies... 
==> Checking buildtime dependencies... 
==> WARNING: Using existing $srcdir/ tree 
==> Starting pkgver()... 
==> Removing existing $pkgdir/ directory... 
==> Starting build()... 
patching file src/html/enmlformatter.cpp 
Hunk #1 FAILED at 23. 
1 out of 1 hunk FAILED -- saving rejects to file src/html/enmlformatter.cpp.rej
patching file src/main.cpp 
Hunk #1 FAILED at 46. 
1 out of 1 hunk FAILED -- saving rejects to file src/main.cpp.rej 
==> ERROR: A failure occurred in build(). 
    Aborting... 
Error making: nixnote2-git
I'm currently using the AppImage.

vlas commented on 2019-08-11 13:46 (UTC) (edited on 2019-08-11 13:47 (UTC) by vlas)

@Ataraxy @robert7

AppImage also doesn't work. Now using Evernote on web :(

Renewed issue https://github.com/robert7/nixnote2/issues/120

Ataraxy commented on 2019-08-06 09:06 (UTC)

@axolx I suggest you remove your cache (or use "clean build" in yay) and then try again.

@vlas I just rebuilt and I can login fine. Upstream has good documentation on getting logs: https://github.com/robert7/nixnote2/wiki/HowTo---Add-log-file-to-the-github-issue

robert7 commented on 2019-08-06 08:27 (UTC)

@vlas: Sorry I don't use Arch Linux, so I can't try myself, but it looks like problem on your local system (e.g. some library/dependency/version setup problem).

I suggest try the AppImage build.. Try is very easy and should work "out-of-the-box" just download the file, mark as executable, then run. All dependencies are included.

See https://github.com/robert7/nixnote2/wiki/HowTo---What-to-do-if-the-app-crashes#try-to-use-the-appimage-version

vlas commented on 2019-08-03 23:26 (UTC)

Asks for login forever. So it's not working.

axolx commented on 2019-04-03 05:42 (UTC)

I'm unable to build this package.

[nixnote2-git]$ sudo pacman -Ss poppler-qt5
extra/poppler-qt5 0.75.0-1 [installed]
    Poppler Qt5 bindings

[nixnote2-git]$ makepkg -Acs
==> Making package: nixnote2-git 2.1.3.r0.g01eac69e-1 (Tue 02 Apr 2019 10:39:49 PM PDT)
==> Checking runtime dependencies...
==> Checking buildtime dependencies...
==> Retrieving sources...
  -> Updating nixnote2 git repo...
Fetching origin
  -> Found tidy-source-dir-location.patch
==> Validating source files with sha256sums...
    nixnote2 ... Skipped
    tidy-source-dir-location.patch ... Passed
==> Extracting sources...
  -> Creating working copy of nixnote2 git repo...
Reset branch 'makepkg'
==> Starting pkgver()...
==> Removing existing $pkgdir/ directory...
==> Starting build()...
patching file src/html/enmlformatter.cpp
Hunk #1 succeeded at 23 with fuzz 2.
patching file src/main.cpp
Project MESSAGE: nixnote2: Release build!
Project MESSAGE: nixnote2: Compiler version 8
Project MESSAGE: nixnote2: Adding compiler config g++8
Project MESSAGE: Target binary: qmake-build-release/nixnote2
Project ERROR: poppler-qt5 development package not found
==> ERROR: A failure occurred in build().
    Aborting...

[nixnote2-git]$ git show -q
commit 2946cc93bdf930402438c4710239a0e86c909ea1 (HEAD -> master, origin/master, origin/HEAD)
Author: Tom "Ravi" Hale <tom@hale.ee>
Date:   Tue Dec 11 16:46:19 2018 +1100

    Patch tidy header locations

I'd be happy to help troubleshoot. Please let me know how I can help.

Ataraxy commented on 2018-12-11 08:29 (UTC)

Thanks for pinpointing the commit, @robert7.

I've added a patch to revert the changes of that commit and it all builds properly now.

robert7 commented on 2018-12-05 08:26 (UTC) (edited on 2018-12-05 08:26 (UTC) by robert7)

@kaptoxic: you problem is caused by an upstream change and the build recipe in AUR needs to be adapted

upstream change: https://github.com/robert7/nixnote2/commit/951dbda3d40e680b29fc45776f456addd7165b9c

The change in the include path for "tidy.h" was needed to make the source work with the new libtidy-dev 5.6.0 in debian unstable https://packages.debian.org/sid/amd64/libtidy-dev/download

@Ataraxy: pls contact me, in case its unclear how to fix the build recipe

kaptoxic commented on 2018-12-04 22:07 (UTC)

I got an error; I am doing something wrong?

src/main.cpp:49:10: fatal error: tidy/tidy.h: No such file or directory
 #include <tidy/tidy.h>

Ataraxy commented on 2018-10-13 06:02 (UTC) (edited on 2018-10-13 06:20 (UTC) by Ataraxy)

I can now confirm this package builds correctly in a chroot so all the makedepends are correct.

Thanks for the positive report @michaldybczak.

I'm using make -j $(nproc) to build using all available cores, so the 100% across the board is expected. Did it make your system too sluggish?

michaldybczak commented on 2018-10-12 18:51 (UTC) (edited on 2018-10-12 18:52 (UTC) by michaldybczak)

I switched to different AUR helper to avoid old cache (this time I used yay) and the package compiled correctly! :) The only weird thing about it was it used on 100% all of my 8 CPU threads. I have never seen such high CPU usage - ever. Even Firefox compilation wasn't so intense, there are always some threads below 100%, but not this time. However, in overall nixnote20git compilation took only a few minutes so it's not bad. Thanks, @Ataraxy.

Ataraxy commented on 2018-10-12 11:35 (UTC)

@ljubacanoa I've added makedepends boost which should solve your problem, and also gcc for completeness. Sorry for the iterations - I'm still working out how to do a chroot build assuming no pre-installed dependencies.

@michaldybczak I just tried building after deleting my cache and it was fine. Perhaps you could try the same?

michaldybczak commented on 2018-10-11 19:50 (UTC)

Still nothing on my end, the problem seems to be the same but different files are missing:

'CONTRIBUTING.md' and 'debian/changelog'

ljubacanoa commented on 2018-10-11 12:18 (UTC)

:: Processing package changes... (1/1) installing qt5-tools [######################] 100% Optional dependencies for qt5-tools clang: for qdoc qt5-webkit: for Qt Assistant [installed] :: Running post-transaction hooks... (1/3) Updating icon theme caches... (2/3) Arming ConditionNeedsUpdate... (3/3) Updating the desktop file MIME type cache... ==> Making package: nixnote2-git 2.1.0.beta4g.r17.g2065b702-4 (Thu 11 Oct 2018 07:16:36 AM -05) ==> Retrieving sources... -> Updating nixnote2 git repo... Fetching origin remote: Enumerating objects: 12, done. remote: Counting objects: 100% (12/12), done. remote: Compressing objects: 100% (3/3), done. remote: Total 12 (delta 10), reused 11 (delta 9), pack-reused 0 Unpacking objects: 100% (12/12), done. From https://github.com/robert7/nixnote2 faedc935..115a2c06 develop -> develop f97fcb70..1a5f63d4 feature/rc1 -> feature/rc1 t [tag update] continuous-develop -> continuous-develop ==> Validating source files with sha256sums... nixnote2 ... Skipped ==> Cleaning up... ==> Making package: nixnote2-git 2.1.0.beta4g.r17.g2065b702-4 (Thu 11 Oct 2018 07:16:39 AM -05) ==> Checking runtime dependencies... ==> Checking buildtime dependencies... ==> Retrieving sources... -> Updating nixnote2 git repo... Fetching origin ==> Validating source files with sha256sums... nixnote2 ... Skipped ==> Removing existing $srcdir/ directory... ==> Extracting sources... -> Creating working copy of nixnote2 git repo... Cloning into 'nixnote2'... done. ==> Starting pkgver()... ==> Sources are ready. ==> Making package: nixnote2-git 2.1.0.beta4g.r17.g2065b702-4 (Thu 11 Oct 2018 07:16:43 AM -05) ==> Checking runtime dependencies... ==> Checking buildtime dependencies... ==> WARNING: Using existing $srcdir/ tree ==> Starting pkgver()... ==> Starting build()... Info: creating stash file /home/ljuba/.cache/yay/nixnote2-git/src/nixnote2/.qmake.stash Project MESSAGE: nixnote2: Release build! Project MESSAGE: nixnote2: Compiler version 8 Project MESSAGE: nixnote2: Adding compiler config g++8 Project MESSAGE: Target binary: qmake-build-release/nixnote2 ./development/create-build-version.sh qmake-build-release /usr/bin/lrelease -compress -nounfinished -removeidentical translations/nixnote2_cs_CZ.ts -qm qmake-build-release/translations/nixnote2_cs_CZ.qm /usr/bin/lrelease -compress -nounfinished -removeidentical translations/nixnote2_de.ts -qm qmake-build-release/translations/nixnote2_de.qm /usr/bin/lrelease -compress -nounfinished -removeidentical translations/nixnote2_en_GB.ts -qm qmake-build-release/translations/nixnote2_en_GB.qm ./development/create-build-version.sh: DESTDIR=qmake-build-release Version: 2.1.0-beta4g Git hash: 2065b702 /usr/bin/lrelease -compress -nounfinished -removeidentical translations/nixnote2_ca.ts -qm qmake-build-release/translations/nixnote2_ca.qm Updating 'qmake-build-release/translations/nixnote2_en_GB.qm'... Removing translations equal to source text in 'qmake-build-release/translations/nixnote2_en_GB.qm'... Updating 'qmake-build-release/translations/nixnote2_cs_CZ.qm'... Removing translations equal to source text in 'qmake-build-release/translations/nixnote2_cs_CZ.qm'... Generated 882 translation(s) (882 finished and 0 unfinished) Ignored 50 untranslated source text(s) Updating 'qmake-build-release/translations/nixnote2_de.qm'... Removing translations equal to source text in 'qmake-build-release/translations/nixnote2_de.qm'... /usr/bin/lrelease -compress -nounfinished -removeidentical translations/nixnote2_da.ts -qm qmake-build-release/translations/nixnote2_da.qm Updating 'qmake-build-release/translations/nixnote2_ca.qm'... Removing translations equal to source text in 'qmake-build-release/translations/nixnote2_ca.qm'... Generated 0 translation(s) (0 finished and 0 unfinished) Ignored 932 untranslated source text(s) Generated 661 translation(s) (661 finished and 0 unfinished) Ignored 194 untranslated source text(s) Generated 773 translation(s) (773 finished and 0 unfinished) Ignored 114 untranslated source text(s) /usr/bin/lrelease -compress -nounfinished -removeidentical translations/nixnote2_es.ts -qm qmake-build-release/translations/nixnote2_es.qm /usr/bin/lrelease -compress -nounfinished -removeidentical translations/nixnote2_ja.ts -qm qmake-build-release/translations/nixnote2_ja.qm /usr/bin/lrelease -compress -nounfinished -removeidentical translations/nixnote2_pt.ts -qm qmake-build-release/translations/nixnote2_pt.qm Updating 'qmake-build-release/translations/nixnote2_da.qm'... Removing translations equal to source text in 'qmake-build-release/translations/nixnote2_da.qm'... Generated 0 translation(s) (0 finished and 0 unfinished) Ignored 932 untranslated source text(s) /usr/bin/lrelease -compress -nounfinished -removeidentical translations/nixnote2_sk.ts -qm qmake-build-release/translations/nixnote2_sk.qm Updating 'qmake-build-release/translations/nixnote2_es.qm'... Removing translations equal to source text in 'qmake-build-release/translations/nixnote2_es.qm'... Generated 0 translation(s) (0 finished and 0 unfinished) Ignored 932 untranslated source text(s) /usr/bin/lrelease -compress -nounfinished -removeidentical translations/nixnote2_zh_TW.ts -qm qmake-build-release/translations/nixnote2_zh_TW.qm Updating 'qmake-build-release/translations/nixnote2_ja.qm'... Removing translations equal to source text in 'qmake-build-release/translations/nixnote2_ja.qm'... Updating 'qmake-build-release/translations/nixnote2_pt.qm'... Removing translations equal to source text in 'qmake-build-release/translations/nixnote2_pt.qm'... Generated 0 translation(s) (0 finished and 0 unfinished) Ignored 932 untranslated source text(s) Generated 462 translation(s) (462 finished and 0 unfinished) Ignored 381 untranslated source text(s) /usr/bin/lrelease -compress -nounfinished -removeidentical translations/nixnote2_fr.ts -qm qmake-build-release/translations/nixnote2_fr.qm /usr/bin/lrelease -compress -nounfinished -removeidentical translations/nixnote2_pl.ts -qm qmake-build-release/translations/nixnote2_pl.qm Updating 'qmake-build-release/translations/nixnote2_sk.qm'... Removing translations equal to source text in 'qmake-build-release/translations/nixnote2_sk.qm'... Generated 0 translation(s) (0 finished and 0 unfinished) Ignored 932 untranslated source text(s) /usr/bin/lrelease -compress -nounfinished -removeidentical translations/nixnote2_ru.ts -qm qmake-build-release/translations/nixnote2_ru.qm Updating 'qmake-build-release/translations/nixnote2_zh_TW.qm'... Removing translations equal to source text in 'qmake-build-release/translations/nixnote2_zh_TW.qm'... Updating 'qmake-build-release/translations/nixnote2_fr.qm'... Removing translations equal to source text in 'qmake-build-release/translations/nixnote2_fr.qm'... Generated 499 translation(s) (499 finished and 0 unfinished) Ignored 356 untranslated source text(s) /usr/bin/lrelease -compress -nounfinished -removeidentical translations/nixnote2_zh_CN.ts -qm qmake-build-release/translations/nixnote2_zh_CN.qm Generated 532 translation(s) (532 finished and 0 unfinished) Ignored 295 untranslated source text(s) g++ -c -pipe -std=c++11 -g -O2 -Wformat -Werror=format-security -fstack-protector-strong -O2 -march=x86-64 -mtune=generic -O2 -pipe -fstack-protector-strong -fno-plt -Wall -W -D_REENTRANT -fPIC -DQT_DISABLE_DEPRECATED_BEFORE=0 -DQT_NO_DEBUG -DQT_PRINTSUPPORT_LIB -DQT_WEBKITWIDGETS_LIB -DQT_WIDGETS_LIB -DQT_WEBKIT_LIB -DQT_GUI_LIB -DQT_QML_LIB -DQT_NETWORK_LIB -DQT_SQL_LIB -DQT_XML_LIB -DQT_DBUS_LIB -DQT_CORE_LIB -I. -isystem /usr/include/poppler/qt5 -isystem /usr/include/poppler -isystem /usr/include/hunspell -isystem /usr/include/qt -isystem /usr/include/qt/QtPrintSupport -isystem /usr/include/qt/QtWebKitWidgets -isystem /usr/include/qt/QtWidgets -isystem /usr/include/qt/QtWebKit -isystem /usr/include/qt/QtGui -isystem /usr/include/qt/QtQml -isystem /usr/include/qt/QtNetwork -isystem /usr/include/qt/QtSql -isystem /usr/include/qt/QtXml -isystem /usr/include/qt/QtDBus -isystem /usr/include/qt/QtCore -Iqmake-build-release -isystem /usr/include/libdrm -I/usr/lib/qt/mkspecs/linux-g++ -o qmake-build-release/application.o src/application.cpp Updating 'qmake-build-release/translations/nixnote2_ru.qm'... Removing translations equal to source text in 'qmake-build-release/translations/nixnote2_ru.qm'... Updating 'qmake-build-release/translations/nixnote2_pl.qm'... Removing translations equal to source text in 'qmake-build-release/translations/nixnote2_pl.qm'... Generated 315 translation(s) (315 finished and 0 unfinished) Ignored 559 untranslated source text(s) Generated 0 translation(s) (0 finished and 0 unfinished) Ignored 932 untranslated source text(s) g++ -c -pipe -std=c++11 -g -O2 -Wformat -Werror=format-security -fstack-protector-strong -O2 -march=x86-64 -mtune=generic -O2 -pipe -fstack-protector-strong -fno-plt -Wall -W -D_REENTRANT -fPIC -DQT_DISABLE_DEPRECATED_BEFORE=0 -DQT_NO_DEBUG -DQT_PRINTSUPPORT_LIB -DQT_WEBKITWIDGETS_LIB -DQT_WIDGETS_LIB -DQT_WEBKIT_LIB -DQT_GUI_LIB -DQT_QML_LIB -DQT_NETWORK_LIB -DQT_SQL_LIB -DQT_XML_LIB -DQT_DBUS_LIB -DQT_CORE_LIB -I. -isystem /usr/include/poppler/qt5 -isystem /usr/include/poppler -isystem /usr/include/hunspell -isystem /usr/include/qt -isystem /usr/include/qt/QtPrintSupport -isystem /usr/include/qt/QtWebKitWidgets -isystem /usr/include/qt/QtWidgets -isystem /usr/include/qt/QtWebKit -isystem /usr/include/qt/QtGui -isystem /usr/include/qt/QtQml -isystem /usr/include/qt/QtNetwork -isystem /usr/include/qt/QtSql -isystem /usr/include/qt/QtXml -isystem /usr/include/qt/QtDBus -isystem /usr/include/qt/QtCore -Iqmake-build-release -isystem /usr/include/libdrm -I/usr/lib/qt/mkspecs/linux-g++ -o qmake-build-release/global.o src/global.cpp g++ -c -pipe -std=c++11 -g -O2 -Wformat -Werror=format-security -fstack-protector-strong -O2 -march=x86-64 -mtune=generic -O2 -pipe -fstack-protector-strong -fno-plt -Wall -W -D_REENTRANT -fPIC -DQT_DISABLE_DEPRECATED_BEFORE=0 -DQT_NO_DEBUG -DQT_PRINTSUPPORT_LIB -DQT_WEBKITWIDGETS_LIB -DQT_WIDGETS_LIB -DQT_WEBKIT_LIB -DQT_GUI_LIB -DQT_QML_LIB -DQT_NETWORK_LIB -DQT_SQL_LIB -DQT_XML_LIB -DQT_DBUS_LIB -DQT_CORE_LIB -I. -isystem /usr/include/poppler/qt5 -isystem /usr/include/poppler -isystem /usr/include/hunspell -isystem /usr/include/qt -isystem /usr/include/qt/QtPrintSupport -isystem /usr/include/qt/QtWebKitWidgets -isystem /usr/include/qt/QtWidgets -isystem /usr/include/qt/QtWebKit -isystem /usr/include/qt/QtGui -isystem /usr/include/qt/QtQml -isystem /usr/include/qt/QtNetwork -isystem /usr/include/qt/QtSql -isystem /usr/include/qt/QtXml -isystem /usr/include/qt/QtDBus -isystem /usr/include/qt/QtCore -Iqmake-build-release -isystem /usr/include/libdrm -I/usr/lib/qt/mkspecs/linux-g++ -o qmake-build-release/main.o src/main.cpp Updating 'qmake-build-release/translations/nixnote2_zh_CN.qm'... Removing translations equal to source text in 'qmake-build-release/translations/nixnote2_zh_CN.qm'... Generated 833 translation(s) (833 finished and 0 unfinished) Ignored 86 untranslated source text(s) g++ -c -pipe -std=c++11 -g -O2 -Wformat -Werror=format-security -fstack-protector-strong -O2 -march=x86-64 -mtune=generic -O2 -pipe -fstack-protector-strong -fno-plt -Wall -W -D_REENTRANT -fPIC -DQT_DISABLE_DEPRECATED_BEFORE=0 -DQT_NO_DEBUG -DQT_PRINTSUPPORT_LIB -DQT_WEBKITWIDGETS_LIB -DQT_WIDGETS_LIB -DQT_WEBKIT_LIB -DQT_GUI_LIB -DQT_QML_LIB -DQT_NETWORK_LIB -DQT_SQL_LIB -DQT_XML_LIB -DQT_DBUS_LIB -DQT_CORE_LIB -I. -isystem /usr/include/poppler/qt5 -isystem /usr/include/poppler -isystem /usr/include/hunspell -isystem /usr/include/qt -isystem /usr/include/qt/QtPrintSupport -isystem /usr/include/qt/QtWebKitWidgets -isystem /usr/include/qt/QtWidgets -isystem /usr/include/qt/QtWebKit -isystem /usr/include/qt/QtGui -isystem /usr/include/qt/QtQml -isystem /usr/include/qt/QtNetwork -isystem /usr/include/qt/QtSql -isystem /usr/include/qt/QtXml -isystem /usr/include/qt/QtDBus -isystem /usr/include/qt/QtCore -Iqmake-build-release -isystem /usr/include/libdrm -I/usr/lib/qt/mkspecs/linux-g++ -o qmake-build-release/nixnote.o src/nixnote.cpp src/nixnote.cpp:77:10: fatal error: boost/shared_ptr.hpp: No such file or directory #include <boost shared_ptr.hpp=""> ^~~~~~~~~~~~~~~~~~~~~~ compilation terminated. make: [Makefile:4848: qmake-build-release/nixnote.o] Error 1 make: Waiting for unfinished jobs.... ==> ERROR: A failure occurred in build(). Aborting... Error making: nixnote2-git</boost>

Ataraxy commented on 2018-10-11 04:23 (UTC)

@ljubacanoa /usr/bin/lrelease comes from qt5-tools. I've added it as a makedepend.

ljubacanoa commented on 2018-10-10 13:57 (UTC)

:: Parsing SRCINFO (1/1): nixnote2-git ==> Making package: nixnote2-git 2.1.0.beta4g.r17.g2065b702-3 (Wed 10 Oct 2018 08:56:46 AM -05) ==> Retrieving sources... -> Updating nixnote2 git repo... Fetching origin ==> Validating source files with sha256sums... nixnote2 ... Skipped ==> Cleaning up... ==> Making package: nixnote2-git 2.1.0.beta4g.r17.g2065b702-3 (Wed 10 Oct 2018 08:56:49 AM -05) ==> Checking runtime dependencies... ==> Checking buildtime dependencies... ==> Retrieving sources... -> Updating nixnote2 git repo... Fetching origin ==> Validating source files with sha256sums... nixnote2 ... Skipped ==> Removing existing $srcdir/ directory... ==> Extracting sources... -> Creating working copy of nixnote2 git repo... Cloning into 'nixnote2'... done. ==> Starting pkgver()... ==> Sources are ready. ==> Making package: nixnote2-git 2.1.0.beta4g.r17.g2065b702-3 (Wed 10 Oct 2018 08:56:53 AM -05) ==> Checking runtime dependencies... ==> Checking buildtime dependencies... ==> WARNING: Using existing $srcdir/ tree ==> Starting pkgver()... ==> Starting build()... Info: creating stash file /home/ljuba/.cache/yay/nixnote2-git/src/nixnote2/.qmake.stash Project MESSAGE: nixnote2: Release build! Project MESSAGE: nixnote2: Compiler version 8 Project MESSAGE: nixnote2: Adding compiler config g++8 Project MESSAGE: Target binary: qmake-build-release/nixnote2 ./development/create-build-version.sh qmake-build-release /usr/bin/lrelease -compress -nounfinished -removeidentical translations/nixnote2_cs_CZ.ts -qm qmake-build-release/translations/nixnote2_cs_CZ.qm make: /usr/bin/lrelease: Command not found make: [Makefile:1553: qmake-build-release/translations/nixnote2_cs_CZ.qm] Error 127 make: Waiting for unfinished jobs.... ./development/create-build-version.sh: DESTDIR=qmake-build-release Version: 2.1.0-beta4g Git hash: 2065b702 ==> ERROR: A failure occurred in build(). Aborting... Error making: nixnote2-git

Ataraxy commented on 2018-10-10 06:40 (UTC) (edited on 2018-10-10 06:41 (UTC) by Ataraxy)

@michaldybczak Upstream changed the doco files. Updated to match.

@ljubacanoa added qt5-base makedepend.

Please vote if you find this package useful. Cheers!

michaldybczak commented on 2018-10-09 18:16 (UTC)

Still can't update it. I'm not a technical user so I can't fix PKGBUILD on my own as I don't understand the nature of those problems, but this package was working fine and now it just won't update. The error changed thou: cat install.sh >install chmod a+x install make[1]: Leaving directory '/make/nixnote2-git/src/nixnote2' cat install.sh >install chmod a+x install install: can't execute stat on 'docs/shortcuts-howto.md': No such file or directory install: an't execute stat on 'docs/CHANGELOG.md': No such file or directory ==> ERROR: There is error in package(). Aborting... :: Unable to build nixnote2-git - makepkg exited with code: 4

ljubacanoa commented on 2018-10-08 14:44 (UTC)

Can't be build:

Project MESSAGE: Target binary: qmake-build-release/nixnote2 ./development/create-build-version.sh qmake-build-release ./development/create-build-version.sh: DESTDIR=qmake-build-release Version: 2.1.0-beta4d Git hash: 8f235769 /usr/bin/lrelease -compress -nounfinished -removeidentical translations/nixnote2_cs_CZ.ts -qm qmake-build-release/translations/nixnote2_cs_CZ.qm make: /usr/bin/lrelease: Command not found make: *** [Makefile:1548: qmake-build-release/translations/nixnote2_cs_CZ.qm] Error 127 ==> ERROR: A failure occurred in build(). Aborting... Error making: nixnote2-git

Ataraxy commented on 2018-10-08 02:46 (UTC)

@michaldybczak Thanks for the report.

I removed the strip as it goes against the best practices of packaging - pkgbuild does it by default and allows it to be disabled should a user desire.

Please note you can use markdown syntax here.

michaldybczak commented on 2018-10-07 22:25 (UTC)

New upodate from 7.10.2018 can't be build:

==> Starting build()... make -f Makefile.Release make[1]: Entering directory '/make/nixnote2-git/src/nixnote2' make[1]: Nothing to do in 'first'. make[1]: Leaving the directory '/make/nixnote2-git/src/nixnote2' strip: 'qmake-build-release/nixnote2': No such file ==> ERROR: There's been an error in build(). Aborting... :: Unable to build nixnote2-git - makepkg exited with code: 4

Ataraxy commented on 2018-10-07 11:24 (UTC)

I've taken over as maintainer.

This package builds from the new maintained fork of Nixnote2.