Package Details: nodejs-git 22.4.0.r616.g88beb76e5c1-1

Git Clone URL: (read-only, click to copy)
Package Base: nodejs-git
Description: JavaScript runtime built on Chrome's V8 JavaScript engine
Upstream URL:
Licenses: MIT
Conflicts: nodejs
Provides: nodejs
Submitter: dcai
Maintainer: Chocobo1
Last Packager: Chocobo1
Votes: 10
Popularity: 0.000005
First Submitted: 2010-01-15 05:50 (UTC)
Last Updated: 2024-07-05 08:05 (UTC)

Required by (1710)

Sources (1)

Latest Comments

1 2 3 Next › Last »

arpspoof commented on 2021-02-04 09:20 (UTC) (edited on 2021-02-04 09:21 (UTC) by arpspoof)

01;34 -o /home/me/.cache/pacaur/nodejs-git/src/node/out/Release/gen-regexp-special-case -pthread -rdynamic -m64 -m64 -Wl,-O1,--sort-common,--as-needed,-z,relro,-z,now -Wl,--start-group /home/me/.cache/pacaur/nodejs-git/src/node/out/Release/ /home/me/.cache/pacaur/nodejs-git/src/node/out/Release/ -lz -luv -lbrotlidec -lbrotlienc -lnghttp2 -lcrypto -lssl -licui18n -licuuc -licudata -ldl -lrt -Wl,--end-group
  touch 4467a71463d80c5c9b6eb9e6340d556156be6d66.intermediate
/bin/sh: line 1: 01: command not found
/bin/sh: line 1: 34: command not found
make[1]: *** [tools/v8_gypfiles/ /home/me/.cache/pacaur/nodejs-git/src/node/out/Release/bytecode_builtins_list_generator] Error 127
make[1]: *** Waiting for unfinished jobs....
/bin/sh: line 1: 01: command not found
/bin/sh: line 1: 34: command not found
make[1]: *** [tools/v8_gypfiles/ /home/me/.cache/pacaur/nodejs-git/src/node/out/Release/torque] Error 127
/bin/sh: line 1: 01: command not found
/bin/sh: line 1: 34: command not found
make[1]: *** [tools/v8_gypfiles/ /home/me/.cache/pacaur/nodejs-git/src/node/out/Release/gen-regexp-special-case] Error 127
  LD_LIBRARY_PATH=/home/me/.cache/pacaur/nodejs-git/src/node/out/Release/$LD_LIBRARY_PATH; export LD_LIBRARY_PATH; cd ../tools/v8_gypfiles; mkdir -p /home/me/.cache/pacaur/nodejs-git/src/node/out/Release/obj/gen/inspector-generated-output-root/src/inspector/protocol /home/me/.cache/pacaur/nodejs-git/src/node/out/Release/obj/gen/inspector-generated-output-root/include/inspector; python ../../deps/v8/third_party/inspector_protocol/ --jinja_dir ../../deps/v8/third_party --output_base "/home/me/.cache/pacaur/nodejs-git/src/node/out/Release/obj/gen/inspector-generated-output-root/src/inspector" --config ../../deps/v8/src/inspector/inspector_protocol_config.json --inspector_protocol_dir ../../deps/v8/third_party/inspector_protocol
rm 1ef9370ab2929e8ed3106eb10fcdf3bde74b9825.intermediate 4467a71463d80c5c9b6eb9e6340d556156be6d66.intermediate
make: *** [Makefile:104: node] Error 2
==> ERROR: A failure occurred in build().

aurifier commented on 2020-10-28 12:45 (UTC)

I have a question on how this interacts with an official package, apm. apm claims its nodejs>=10 dependency is not satisfied by this package. How can I tell if the issue is with apm's dependency or nodejs-git's provides?

haawda commented on 2016-10-18 07:14 (UTC)

Rebuild it.

shillshocked commented on 2016-10-18 01:50 (UTC)

node -v node: error while loading shared libraries: cannot open shared object file: No such file or directory

TrialnError commented on 2015-11-24 13:01 (UTC)

The Repo URL should be adjusted. The official one is

yourealwaysbe commented on 2015-11-08 22:48 (UTC)

I'm currently getting the following error when i try to install: ==> Starting pkgver()... fatal: No tags can describe 'c06faa649d93f8a80d3501cf070f1565978ac9fd'. Try --always, or create some tags.

Barthalion commented on 2013-12-24 07:46 (UTC)

Fixed, thanks.

Nowaker commented on 2013-12-24 00:10 (UTC)

nodejs-git: /usr/share/man/man1/node.1.gz exists in filesystem Errors occurred, no packages were upgraded. Should conflicts=('nodejs').

ant commented on 2013-06-12 07:15 (UTC)

==> Making package: nodejs-git 20110613-1 (Wed Jun 12 09:10:23 CEST 2013) ==> Checking runtime dependencies... ==> Checking buildtime dependencies... ==> Retrieving sources... ==> Extracting sources... ==> Starting build()... ==> Connecting to gitosis git server... Cloning into 'nodejs'... remote: Counting objects: 100704, done. remote: Compressing objects: 100% (28281/28281), done. remote: Total 100704 (delta 79306), reused 91275 (delta 70766) Receiving objects: 100% (100704/100704), 62.20 MiB | 4.54 MiB/s, done. Resolving deltas: 100% (79306/79306), done. ==> GIT checkout done or server timeout! ==> applying python2 fixes.. sed: can't read wscript: No such file or directory ==> ERROR: A failure occurred in build(). Aborting... ==> ERROR: Makepkg was unable to build nodejs-git.