Package Details: nuvolaplayer 3.0.4-1

Git Clone URL: (read-only)
Package Base: nuvolaplayer
Description: Cloud music integration for your Linux desktop.
Upstream URL:
Keywords: music network streaming
Licenses: GPL
Submitter: petRUShka
Maintainer: avkonarev
Last Packager: petRUShka
Votes: 109
Popularity: 1.370019
First Submitted: 2012-04-03 14:35
Last Updated: 2017-04-03 20:49

Dependencies (19)

Sources (2)

Latest Comments

laramy2020 commented on 2017-09-22 04:16

I have created updated pkg builds here

if you wish I can help with maintaining.

petRUShka commented on 2017-07-05 10:21

Sorry, I have no time for support that package right now.

Please note me if you want to be added as maintainers of that package.

BuZZ-dEE commented on 2017-07-04 10:50

Can not install this package.

==> Überprüfe source Dateien mit sha256sums...
nuvolaplayer-3.0.4.tar.gz ... FEHLGESCHLAGEN
nuvola-app-1.5.1.template ... Durchgelaufen
==> FEHLER: Eine oder mehrere Dateien überstanden nicht die Gültigkeits-Prüfung!
==> FEHLER:Makepkg konnte nuvolaplayer nicht erstellen.

Nomalag commented on 2017-06-24 14:46

Hi kale-ru, thanks for the updated PKGBUILD. The build fails for me with the following moutput in the log created by pacaur:

Checking for 'dioriteglib-0.2' >= 0.2.2
['/usr/bin/pkg-config', '--atleast-version=0.2.2', 'dioriteglib-0.2']
not found

Could it be that the diorite in the aur is too old?

The "official" PKGBUILD doesn't work for me either, instead I used this:

boyi commented on 2017-06-08 19:56

File name has been changed to nuvolaruntime.

fenryxo commented on 2017-04-08 19:40

Hello Arch users,

The Nuvola project now officially supports Arch Linux since Nuvola 3.1 Milestone 2 thanks to cross-distribution flatpak packages [1]. These are not meant to replace AUR builds but to provide an alternative way to install Nuvola for those users who are not, for whatever reason, satisfied with the Arch way of installation. I believe that Flatpak builds of Nuvola are a huge step forward because Flatpak finally, after years of struggling, allows Nuvola project to pursue its goals [2].

Note that Nuvola 3.1 is currently available only to users with Premium/Patron plan [3] but this will change with the Nuvola 4.0 release later this year.


Best regards,

Jiri Janousek, Nuvola core developer

P.S. If there are any build errors with Nuvola 3.0.7, I recommend that the maintainer of this package should report it upstream.

petRUShka commented on 2017-04-03 20:49

Please create issues in github repository:

I revert changes and set return to 3.0.4

lembang commented on 2017-03-31 23:08

I have the same issue to build this package as well.

viler80 commented on 2017-03-19 17:51

It is necessary to inform the developer. Rolling release is installed and works perfectly

petRUShka commented on 2017-03-18 16:29

Dou you know how to fix it?

viler80 commented on 2017-03-16 12:26

на двух manjaro - gnome и kde одна и та же ошибка при обновлении

zekeer commented on 2017-03-15 18:45

Update to 3.0.7-1
Build failed
-> task in 'nuvolaplayer3-runner' failed (exit status 1):
{task 140551780793480: valac AppRunnerController.vala,MasterController.vala,ActionsBinding.vala,Binding.vala,Bindings.vala,LauncherBinding.vala,MediaKeysBinding.vala,MediaPlayerBinding.vala,MenuBarBinding.vala,NotificationBinding.vala,NotificationsBinding.vala,Component.vala,ComponentsManager.vala,WebApp.vala,WebAppRegistry.vala,WebAppStorage.vala,WebAppWindow.vala,WebWorker.vala,FormatSupport.vala,FormatSupportCheck.vala,FormatSupportDialog.vala,AboutDialog.vala,NetworkSettings.vala,PreferencesDialog.vala,Sidebar.vala,WelcomeWindow.vala,ActionsInterface.vala,MediaKeysInterface.vala,MenuBarInterface.vala,NotificationInterface.vala,NotificationsInterface.vala,AppRunner.vala,LauncherModel.vala,MediaPlayerModel.vala,Connection.vala,Desktop.vala,AppCategoriesView.vala,WebAppListFilter.vala,WebAppListModel.vala,WebAppListView.vala,WebAppListWindow.vala,WebEngine.vala,WebView.vala,WebWindow.vala,ActionsHelper.vala,DeveloperComponent.vala,DeveloperSidebar.vala,ActionsKeyBinder.vala,ActionsKeyBinderClient.vala,ActionsKeyBinderServer.vala,GlobalActionsKeyBinder.vala,GlobalKeyBinder.vala,GlobalKeyBindings.vala,KeybindingsSettings.vala,XKeyGrabber.vala,AZLyricsFetcher.vala,LyricsComponent.vala,LyricsFetcher.vala,LyricsFetcherCache.vala,LyricsProvider.vala,LyricsSidebar.vala,MediaKeyClient.vala,MediaKeyServer.vala,MediaKeys.vala,MediaKeysComponent.vala,MediaPlayer.vala,Menubar.vala,MPRISApplication.vala,MPRISComponent.vala,MPRISPlayer.vala,MPRISProvider.vala,Notifications.vala,NotificationsComponent.vala,AudioScrobbler.vala,AudioScrobblerComponent.vala,LastfmCompatibleScrobbler.vala,LastfmScrobbler.vala,ScrobblerSettings.vala,TrayIcon.vala,TrayIconComponent.vala,UnityLaucher.vala,UnityLauncherComponent.vala -> nuvolaplayer3-runner.h,nuvolaplayer3-runner.vapi,nuvolaplayer3-runner.deps,AppRunnerController.c,MasterController.c,ActionsBinding.c,Binding.c,Bindings.c,LauncherBinding.c,MediaKeysBinding.c,MediaPlayerBinding.c,MenuBarBinding.c,NotificationBinding.c,NotificationsBinding.c,Component.c,ComponentsManager.c,WebApp.c,WebAppRegistry.c,WebAppStorage.c,WebAppWindow.c,WebWorker.c,FormatSupport.c,FormatSupportCheck.c,FormatSupportDialog.c,AboutDialog.c,NetworkSettings.c,PreferencesDialog.c,Sidebar.c,WelcomeWindow.c,ActionsInterface.c,MediaKeysInterface.c,MenuBarInterface.c,NotificationInterface.c,NotificationsInterface.c,AppRunner.c,LauncherModel.c,MediaPlayerModel.c,Connection.c,Desktop.c,AppCategoriesView.c,WebAppListFilter.c,WebAppListModel.c,WebAppListView.c,WebAppListWindow.c,WebEngine.c,WebView.c,WebWindow.c,ActionsHelper.c,DeveloperComponent.c,DeveloperSidebar.c,ActionsKeyBinder.c,ActionsKeyBinderClient.c,ActionsKeyBinderServer.c,GlobalActionsKeyBinder.c,GlobalKeyBinder.c,GlobalKeyBindings.c,KeybindingsSettings.c,XKeyGrabber.c,AZLyricsFetcher.c,LyricsComponent.c,LyricsFetcher.c,LyricsFetcherCache.c,LyricsProvider.c,LyricsSidebar.c,MediaKeyClient.c,MediaKeyServer.c,MediaKeys.c,MediaKeysComponent.c,MediaPlayer.c,Menubar.c,MPRISApplication.c,MPRISComponent.c,MPRISPlayer.c,MPRISProvider.c,Notifications.c,NotificationsComponent.c,AudioScrobbler.c,AudioScrobblerComponent.c,LastfmCompatibleScrobbler.c,LastfmScrobbler.c,ScrobblerSettings.c,TrayIcon.c,TrayIconComponent.c,UnityLaucher.c,UnityLauncherComponent.c}

TingPing commented on 2017-01-26 01:41

You should remove the install file as it is no longer needed.

petRUShka commented on 2017-01-21 11:13

For those who interesting

1. Nuvola Player 3.0 is the current stable series. Latest stable release is 3.0.4. Next stable release is 3.0.5, milestone: , ,
2. There is 3.1.1 release but it is still the current rolling series.

Yegorius commented on 2016-09-08 11:19

Makepkg refuses to build the package, please update .SRCINFO

petRUShka commented on 2016-07-22 19:50

@Celti, sorry for long delay. I've added you to maintainers list. Please feel free to make changes.

Anonymous comment on 2016-05-24 09:31

I am now maintaining a new unofficial user repository (details at with all appropriate Arch Linux packages for Nuvola Player and its integrations.

For compatibility across the ecosystem, you may wish to use the PKGBUILD from that repository for this package:

D3v01d commented on 2016-04-17 15:37

After install I can't open Nuvola with the following error, on a fresh install of Arch, the same happens regardless of which Gnome Theme I am on:

λ chris [~] → nuvolaplayer3
Master: [WARNING DioriteGtk] Icons.vala:40: Failed to load icon 'nuvolaplayer3': Icon 'nuvolaplayer3' not present in theme Vibrancy-Dark-Orange
Master: [WARNING Nuvola] WebAppListWindow.vala:52: Unable to load application icon.
Master: [WARNING Nuvola] WelcomeWindow.vala:94: Unable to load application icon.
[1] 20105 segmentation fault (core dumped) nuvolaplayer3

fenryxo commented on 2016-03-11 13:38

This package should depend only on the diorite package, which provides diorite{glib,gtk}-0.2 libraries, not on diorite-git, which provides diorite{glib,gtk}-0.3 libraries.

petRUShka commented on 2016-03-09 18:09

@lockheed, that is very strange error. There isn't `dioriteglib-0.2` dependency. Try to install aur/diorite manually before installing nuvola.

lockheed commented on 2016-03-02 09:58

I can't build this package because

Checking for 'dioriteglib-0.2' >= 0.2 : not found

And there is no such package in the repositories.

LKHN commented on 2016-01-06 12:46

Development of Nuvola Player 3 has moved to GitHub:

Please update it.

fenryxo commented on 2015-08-14 21:17

It's time to switch to Nuvola Player 3.

MightyPork commented on 2015-08-12 12:03

Got the same error I think.

JohnRobson commented on 2015-08-11 17:35


larsrh commented on 2015-07-20 11:39

The "Conflicts" field probably has a typo: "musc" instead of "music".

ValHue commented on 2015-07-12 10:03

@ikhthiandor, @securitybreach IDEM :-(

ikhthiandor commented on 2015-04-30 03:00

I get the same error as securitybreach. How can we fix this?

securitybreach commented on 2015-04-27 00:07

Build fails:
Build failed
-> task in 'tests/bin/guidemo' failed (exit status 1):
{task 139679905052240: valac gui-formatsupportdialogdemo.vala,gui-infobardemo.vala,gui-main.vala,gui-mainwindow-test.vala,gui-wrappedlabeldemo.vala -> gui-formatsupportdialogdemo.c,gui-infobardemo.c,gui-main.c,gui-mainwindow-test.c,gui-wrappedlabeldemo.c}
==> ERROR: A failure occurred in package().
:: nuvolaplayer cleaning skipped
:: failed to build nuvolaplayer package(s)

rcrath commented on 2015-03-09 03:37

build fails, log on

rcrath commented on 2015-03-09 03:16

build fails with
"Build failed
-> task in 'tests/bin/guidemo' failed (exit status 1):
{task 140108190406608: valac gui-formatsupportdialogdemo.vala,gui-infobardemo.vala,gui-main.vala,gui-mainwindow-test.vala,gui-wrappedlabeldemo.vala -> gui-formatsupportdialogdemo.c,gui-infobardemo.c,gui-main.c,gui-mainwindow-test.c,gui-wrappedlabeldemo.c}


a little earlier it says:

Compilation failed: 2 error(s), 0 warning(s)
/tmp/nuvolaplayer-2.5/tests/uidemo/gui-infobardemo.vala:32.2-32.18: error: destructor and parent symbol name do not match
/tmp/nuvolaplayer-2.5/tests/uidemo/gui-wrappedlabeldemo.vala:22.2-22.18: error: destructor and parent symbol name do not match


config says valac 0.8 not found, but configures successfully

ollidiemaus commented on 2015-02-06 14:03

Does anyone know why my playback in play music is not starting? Its just loading and after some time it skips the current songs and trys the next one.

evilgnome commented on 2015-01-14 18:42

@michaudg Thanks, it worked here as well!

@petRUShka It would be nice if you

- added nspluginwrapper to opt depends for flash plugin support,
- and lib32-libpulse and lib32-alsa-plugins to opt depends for flash plugin support on 64 bit systems.
- It might also be a good idea to add the script at to the sources and install that somewhere on the system.

michaudg commented on 2015-01-14 15:20

@evilgnome @selaux This guide works for me :

selaux commented on 2015-01-13 07:38

Has anyone got flash working with this?

evilgnome commented on 2014-12-18 20:25

@strugee, do you have flash working in this?

evilgnome commented on 2014-12-15 05:51

This doesn't seem to pick up on a flash installation even with nspluginwrapper installed, and nspluginwrapper is not listed as an optional dependency.

TheNumb commented on 2014-12-09 20:38

2.5.0 is out

strugee commented on 2014-11-14 09:21

This is expected. You need to install the Flash wrapper for it to work.

See the Launchpad for details.

Zyclon commented on 2014-11-14 08:50

google music is disfucntional. flahsplugin and lib32 flashplugin are installed, but webkitgtk does not use them for some reason

orkeren commented on 2014-11-10 11:44

Out of date flag is wrong. My mistake. 2.5 is still flagged as unstable.

archerix commented on 2014-06-04 01:28

It has been update to 2.4.0..

petRUShka commented on 2014-04-28 11:54

Version 2.3.2 has incompatibility with vala 0.24 that we have in arch repository. So it took some time to figure what the reason and fix it. (Fix was released 15 april:

Now it is updated.

lockheed commented on 2014-04-19 11:25

Can we expect some update? 2.3.2 is available since several weeks now and it is a major bug-fix release.

jck commented on 2014-03-27 13:15

This bug has been fixed in 2.3.2

Zwiebel commented on 2014-03-06 03:01

@SMOG: This is currently reported as a critical bug and is reportedly being worked on:

strugee commented on 2014-03-06 00:47

Could you add lib32-flashplugin as an optional dependency? This is needed for Flash plugin support on 64-bit systems.

SMOG commented on 2013-12-27 09:50

Am I the only one having Nuvola using 800-900 MB of RAM at start and after playing a few songs arriving at ~1,4 GB?
I just use the Google Play Music service.

Thank you in advance...

matthias.gliwka commented on 2013-12-26 13:03

That's the PKGBUILD i used for 2.3:

matthias.gliwka commented on 2013-12-26 12:44

I've just replaced the version strings with 2.3 and the md5 with the new hashsum 63e4088c994dce39b59eb2aa23810e36 + i've patched the wscript file to not run tests, 'because the --skip-test flag is ignored on glibtest and this particular test runs forever.

jesusignacio commented on 2013-12-25 01:05

Foxtrot commented on 2013-12-01 14:01

I tried to install nuvolaplayer but i get an error

the console says "There was an error in build()"
This is the console output:

SMOG commented on 2013-11-27 12:42

@skad: I was able to compile adding the --no-notifications option to the waf configure line in build() in PKGBUILD.
It disables notifications support, but at least it compile...

skad commented on 2013-11-21 12:22

Same as SMOG :
Unable to compile

Error :

SMOG commented on 2013-11-14 11:36

Hi everyone,
I've some problem during build(), it isn't able to compile nuvolaplayer 2.2.0. Any hint?


SMOG commented on 2013-11-14 11:33

Hi everyone,
I've some problem during build(), it isn't able to compile nuvolaplayer 2.2.0. Any hint?

==> Avvio di build() in corso...
Setting top to : /tmp/yaourt-tmp-fra/aur-nuvolaplayer/src/nuvolaplayer-2.2.0
Setting out to : /tmp/yaourt-tmp-fra/aur-nuvolaplayer/src/nuvolaplayer-2.2.0/build
Revision : 773
Install prefix : /usr
Checking for 'gcc' (c compiler) : /usr/bin/gcc
Checking for program pkg-config : /usr/bin/pkg-config
Checking for 'gobject-2.0' : yes
Checking for 'gthread-2.0' : yes
Checking for program valac-0.8 : not found
Checking for program valac : /usr/bin/valac
Checking for valac version >= (0, 8, 0) : (0, 22, 1)
Checking for program gtester : /usr/bin/gtester
Checking for program valac-0.14 : /usr/bin/valac
Checking for valac-0.14 version >= (0, 14, 2) : (0, 22, 1)
Checking for program msgfmt : /usr/bin/msgfmt
Checking for program perl : /usr/bin/perl
Checking for 'intltool-merge' : /usr/bin/intltool-merge
Checking for header locale.h : yes
Compiler optimizations : ON
Checking for 'gee-1.0' >= 0.6 : yes
Checking for 'libnotify' >= 0.7 : yes
Checking for 'x11' >= 0.5 : yes
Checking for 'gtk+-3.0' >= 3.4 : yes
Checking for 'gdk-3.0' >= 3.4 : yes
Checking for 'gstreamer-1.0' >= 1.0 : yes
Checking for 'libsoup-2.4' version : yes
Checking for 'libsoup-2.4' >= 2.38 : yes
Checking for 'json-glib-1.0' >= 0.7 : yes
Checking for 'unity' >= 3.0 : not found
Checking for 'dbusmenu-glib-0.4' >= 0.4 : not found
Checking for 'webkitgtk-3.0' >= 1.8 : yes
Checking for 'javascriptcoregtk-3.0' >= 1.8 : yes
Checking for 'glib-2.0' >= 2.32 : yes
Checking for 'gio-2.0' >= 2.32 : yes
Checking for program rsvg-convert : /usr/bin/rsvg-convert
Checking for program scour : /usr/bin/scour

Configuration status : OK

Unity Quicklist : OFF
optimization of SVG images : ON scrobbling : ON
Notifications : ON
experimental features : OFF
debug symbols : OFF
debug memory usage : OFF
'configure' finished successfully (0.456s)
Waf: Entering directory `/tmp/yaourt-tmp-fra/aur-nuvolaplayer/src/nuvolaplayer-2.2.0/build'
[ 16/111] valac: src/diorite/configuration.vala src/diorite/connection.vala src/diorite/diorite-infobar.vala src/diorite/diorite-simpledocbuffer.vala src/diorite/diorite-simpledocview.vala src/diorite/diorite-wrappedlabel.vala src/diorite/f-actions.vala src/diorite/f-application.vala src/diorite/keybindings.vala src/diorite/logger.vala src/diorite/storage.vala src/diorite/system.vala src/diorite/test.vala src/diorite/tests.vala src/diorite/tools.vala src/diorite/uiparser.vala src/diorite/widgets.vala src/nuvola/core/config.vala src/nuvola/core/core.vala src/nuvola/core/extension.vala src/nuvola/core/extensionsmanager.vala src/nuvola/core/info.vala src/nuvola/core/jsapi.vala src/nuvola/core/jstools.vala src/nuvola/core/nuvola-formatsupport.vala src/nuvola/core/nuvola-framebridge.vala src/nuvola/core/objectcontainer.vala src/nuvola/core/player.vala src/nuvola/core/service.vala src/nuvola/core/servicesmanager.vala src/nuvola/core/settings.vala src/nuvola/core/webbackend.vala src/nuvola/extensions/debugging.vala src/nuvola/extensions/developerbar.vala src/nuvola/extensions/dock_manager.vala src/nuvola/extensions/lastfm.vala src/nuvola/extensions/lyrics.vala src/nuvola/extensions/media_keys.vala src/nuvola/extensions/mpris.vala src/nuvola/extensions/notifications.vala src/nuvola/extensions/sample.vala src/nuvola/extensions/trayicon.vala src/nuvola/extensions/unity_quick_list.vala src/nuvola/gui/aboutdialog.vala src/nuvola/gui/downloadsdialog.vala src/nuvola/gui/extensionsmanagerview.vala src/nuvola/gui/inspectorwindow.vala src/nuvola/gui/mainwebview.vala src/nuvola/gui/mainwindow.vala src/nuvola/gui/nuvola-formatsupportdialog.vala src/nuvola/gui/nuvola-welcomeoverlay.vala src/nuvola/gui/popupwebview.vala src/nuvola/gui/preferences.vala src/nuvola/gui/serviceselectordialog.vala src/nuvola/gui/servicesmanagerview.vala src/nuvola/gui/staticwebview.vala src/nuvola/gui/webview.vala -> build/nuvolaplayerprivate.h build/nuvolaplayerprivate.vapi build/nuvolaplayerprivate.deps build/src/diorite/configuration.c build/src/diorite/connection.c build/src/diorite/diorite-infobar.c build/src/diorite/diorite-simpledocbuffer.c build/src/diorite/diorite-simpledocview.c build/src/diorite/diorite-wrappedlabel.c build/src/diorite/f-actions.c build/src/diorite/f-application.c build/src/diorite/keybindings.c build/src/diorite/logger.c build/src/diorite/storage.c build/src/diorite/system.c build/src/diorite/test.c build/src/diorite/tests.c build/src/diorite/tools.c build/src/diorite/uiparser.c build/src/diorite/widgets.c build/src/nuvola/core/config.c build/src/nuvola/core/core.c build/src/nuvola/core/extension.c build/src/nuvola/core/extensionsmanager.c build/src/nuvola/core/info.c build/src/nuvola/core/jsapi.c build/src/nuvola/core/jstools.c build/src/nuvola/core/nuvola-formatsupport.c build/src/nuvola/core/nuvola-framebridge.c build/src/nuvola/core/objectcontainer.c build/src/nuvola/core/player.c build/src/nuvola/core/service.c build/src/nuvola/core/servicesmanager.c build/src/nuvola/core/settings.c build/src/nuvola/core/webbackend.c build/src/nuvola/extensions/debugging.c build/src/nuvola/extensions/developerbar.c build/src/nuvola/extensions/dock_manager.c build/src/nuvola/extensions/lastfm.c build/src/nuvola/extensions/lyrics.c build/src/nuvola/extensions/media_keys.c build/src/nuvola/extensions/mpris.c build/src/nuvola/extensions/notifications.c build/src/nuvola/extensions/sample.c build/src/nuvola/extensions/trayicon.c build/src/nuvola/extensions/unity_quick_list.c build/src/nuvola/gui/aboutdialog.c build/src/nuvola/gui/downloadsdialog.c build/src/nuvola/gui/extensionsmanagerview.c build/src/nuvola/gui/inspectorwindow.c build/src/nuvola/gui/mainwebview.c build/src/nuvola/gui/mainwindow.c build/src/nuvola/gui/nuvola-formatsupportdialog.c build/src/nuvola/gui/nuvola-welcomeoverlay.c build/src/nuvola/gui/popupwebview.c build/src/nuvola/gui/preferences.c build/src/nuvola/gui/serviceselectordialog.c build/src/nuvola/gui/servicesmanagerview.c build/src/nuvola/gui/staticwebview.c build/src/nuvola/gui/webview.c
Loaded package `/tmp/yaourt-tmp-fra/aur-nuvolaplayer/src/nuvolaplayer-2.2.0/external/vala-0.18/glib-2.0.vapi'
Loaded package `/usr/share/vala-0.22/vapi/gobject-2.0.vapi'
Loaded package `/tmp/yaourt-tmp-fra/aur-nuvolaplayer/src/nuvolaplayer-2.2.0/external/vala-0.18/gio-2.0.vapi'
Loaded package `/tmp/yaourt-tmp-fra/aur-nuvolaplayer/src/nuvolaplayer-2.2.0/external/vala-0.18/libsoup-2.4.vapi'
Loaded package `/usr/share/vala/vapi/gee-1.0.vapi'
Loaded package `/tmp/yaourt-tmp-fra/aur-nuvolaplayer/src/nuvolaplayer-2.2.0/external/vala-0.18/gtk+-3.0.vapi'
Loaded package `/usr/share/vala-0.22/vapi/atk.vapi'
Loaded package `/usr/share/vala-0.22/vapi/cairo.vapi'
Loaded package `/usr/share/vala-0.22/vapi/gdk-pixbuf-2.0.vapi'
Loaded package `/tmp/yaourt-tmp-fra/aur-nuvolaplayer/src/nuvolaplayer-2.2.0/external/vala-0.18/gdk-3.0.vapi'
Loaded package `/usr/share/vala-0.22/vapi/pango.vapi'
Loaded package `/usr/share/vala-0.22/vapi/pangocairo.vapi'
Loaded package `/usr/share/vala-0.22/vapi/x11.vapi'
Loaded package `/tmp/yaourt-tmp-fra/aur-nuvolaplayer/src/nuvolaplayer-2.2.0/external/vala-0.18/webkitgtk-3.0.vapi'
Loaded package `/usr/share/vala-0.22/vapi/gdk-x11-3.0.vapi'
Loaded package `/tmp/yaourt-tmp-fra/aur-nuvolaplayer/src/nuvolaplayer-2.2.0/vapi/javascriptcore.vapi'
Loaded package `/usr/share/vala-0.22/vapi/posix.vapi'
Loaded package `/tmp/yaourt-tmp-fra/aur-nuvolaplayer/src/nuvolaplayer-2.2.0/external/vala-0.18/gstreamer-1.0.vapi'
Loaded package `/usr/share/vala-0.22/vapi/json-glib-1.0.vapi'
Loaded package `/usr/share/vala-0.22/vapi/libnotify.vapi'
Compilation failed: 4 error(s), 9 warning(s)
glib-2.0.vapi:3322.118-3322.139: warning: parameter without default follows parameter with default
public string replace_eval (string str, ssize_t string_len, int start_position, RegexMatchFlags match_options = 0, RegexEvalCallback eval) throws RegexError;
glib-2.0.vapi:1687.46-1687.58: warning: delegates with scope="async" must be owned
public static unowned Thread<T> create<T> (ThreadFunc<T> func, bool joinable) throws ThreadError;
glib-2.0.vapi:1687.46-1687.58: warning: delegates with scope="async" must be owned
public static unowned Thread<T> create<T> (ThreadFunc<T> func, bool joinable) throws ThreadError;
glib-2.0.vapi:1690.51-1690.63: warning: delegates with scope="async" must be owned
public static unowned Thread<T> create_full<T> (ThreadFunc<T> func, ulong stack_size, bool joinable, bool bound, ThreadPriority priority) throws ThreadError;
glib-2.0.vapi:1690.51-1690.63: warning: delegates with scope="async" must be owned
public static unowned Thread<T> create_full<T> (ThreadFunc<T> func, ulong stack_size, bool joinable, bool bound, ThreadPriority priority) throws ThreadError;
gio-2.0.vapi:2417.161-2417.180: warning: parameter without default follows parameter with default
public bool load_contents (GLib.Cancellable? cancellable = null, [CCode (array_length_cname = "length", array_length_pos = 2.5, array_length_type = "gsize")] out uint8[] contents, out string etag_out) throws GLib.Error;
gio-2.0.vapi:2417.183-2417.201: warning: parameter without default follows parameter with default
public bool load_contents (GLib.Cancellable? cancellable = null, [CCode (array_length_cname = "length", array_length_pos = 2.5, array_length_type = "gsize")] out uint8[] contents, out string etag_out) throws GLib.Error;
/tmp/yaourt-tmp-fra/aur-nuvolaplayer/src/nuvolaplayer-2.2.0/src/diorite/connection.vala:115.4-115.17: warning: parameter without default follows parameter with default
ProxyType type, string? server = null, string? port = null)
/tmp/yaourt-tmp-fra/aur-nuvolaplayer/src/nuvolaplayer-2.2.0/src/nuvola/extensions/lastfm.vala:582.3-582.16: warning: implicit .begin is deprecated
/tmp/yaourt-tmp-fra/aur-nuvolaplayer/src/nuvolaplayer-2.2.0/src/nuvola/extensions/notifications.vala:109.24-109.62: error: Invalid assignment from owned expression to unowned variable
unowned List<string> capabilities = Notify.get_server_caps();
/tmp/yaourt-tmp-fra/aur-nuvolaplayer/src/nuvolaplayer-2.2.0/src/nuvola/extensions/notifications.vala:110.28-110.39: error: The name `capabilities' does not exist in the context of `Nuvola.Extensions.Notifications.Extension.load'
persistence_supported = capabilities.find_custom("persistence", strcmp) != null;
/tmp/yaourt-tmp-fra/aur-nuvolaplayer/src/nuvolaplayer-2.2.0/src/nuvola/extensions/notifications.vala:111.24-111.35: error: The name `capabilities' does not exist in the context of `Nuvola.Extensions.Notifications.Extension.load'
actions_supported = capabilities.find_custom("actions", strcmp) != null;
/tmp/yaourt-tmp-fra/aur-nuvolaplayer/src/nuvolaplayer-2.2.0/src/nuvola/extensions/notifications.vala:112.22-112.33: error: The name `capabilities' does not exist in the context of `Nuvola.Extensions.Notifications.Extension.load'
icons_supported = capabilities.find_custom("action-icons", strcmp) != null;
Waf: Leaving directory `/tmp/yaourt-tmp-fra/aur-nuvolaplayer/src/nuvolaplayer-2.2.0/build'
Build failed
-> task in 'nuvolaplayerprivate' failed (exit status 1):
{task 27726416: valac configuration.vala,connection.vala,diorite-infobar.vala,diorite-simpledocbuffer.vala,diorite-simpledocview.vala,diorite-wrappedlabel.vala,f-actions.vala,f-application.vala,keybindings.vala,logger.vala,storage.vala,system.vala,test.vala,tests.vala,tools.vala,uiparser.vala,widgets.vala,config.vala,core.vala,extension.vala,extensionsmanager.vala,info.vala,jsapi.vala,jstools.vala,nuvola-formatsupport.vala,nuvola-framebridge.vala,objectcontainer.vala,player.vala,service.vala,servicesmanager.vala,settings.vala,webbackend.vala,debugging.vala,developerbar.vala,dock_manager.vala,lastfm.vala,lyrics.vala,media_keys.vala,mpris.vala,notifications.vala,sample.vala,trayicon.vala,unity_quick_list.vala,aboutdialog.vala,downloadsdialog.vala,extensionsmanagerview.vala,inspectorwindow.vala,mainwebview.vala,mainwindow.vala,nuvola-formatsupportdialog.vala,nuvola-welcomeoverlay.vala,popupwebview.vala,preferences.vala,serviceselectordialog.vala,servicesmanagerview.vala,staticwebview.vala,webview.vala -> nuvolaplayerprivate.h,nuvolaplayerprivate.vapi,nuvolaplayerprivate.deps,configuration.c,connection.c,diorite-infobar.c,diorite-simpledocbuffer.c,diorite-simpledocview.c,diorite-wrappedlabel.c,f-actions.c,f-application.c,keybindings.c,logger.c,storage.c,system.c,test.c,tests.c,tools.c,uiparser.c,widgets.c,config.c,core.c,extension.c,extensionsmanager.c,info.c,jsapi.c,jstools.c,nuvola-formatsupport.c,nuvola-framebridge.c,objectcontainer.c,player.c,service.c,servicesmanager.c,settings.c,webbackend.c,debugging.c,developerbar.c,dock_manager.c,lastfm.c,lyrics.c,media_keys.c,mpris.c,notifications.c,sample.c,trayicon.c,unity_quick_list.c,aboutdialog.c,downloadsdialog.c,extensionsmanagerview.c,inspectorwindow.c,mainwebview.c,mainwindow.c,nuvola-formatsupportdialog.c,nuvola-welcomeoverlay.c,popupwebview.c,preferences.c,serviceselectordialog.c,servicesmanagerview.c,staticwebview.c,webview.c}

petRUShka commented on 2013-10-01 19:28

I've updated version to 2.2.0 and add --skip-tests build option.

butler360 commented on 2013-09-29 06:43

Install of 2.2.0 seems to work fine with just a few PKGBUILD modifications to change version numbers and MD5.

Download link:
MD5: 60bf5075f226960cefe08f9a2ad11af2

@zmbmartin, may need to disable HTML5 audio from the Nuvola preferences for Google Music. Seems counter-intuitive, but it works for me.

SMOG commented on 2013-09-25 11:01

Hi guys,
I have a problem and I'd like to know if you have it too.
Nuvola player (using google music) takes over 500 MB of RAM at startup (no playing) and as I start a song it reaches immediatly over 1 GB of RAM!

Is anyone else noticing this behavior?

Thank you, as always...

SMOG commented on 2013-09-16 11:48

@dkao: thanks that finally worked! I hope this isn't going to harm anything...

dkao commented on 2013-09-15 01:16

@SMOG: 2000 was enough for me
You could try doing "python2 ./waf build --skip-tests" instead and see if there are any actual problems

SMOG commented on 2013-09-14 20:51

@dkao: how and how much have you increased them? I've raised all the FsoFramework.Test.wait_for_signal parameters in tests/main/nuvola-jsapitest (from 500 to 5000 and from 1000 to 10000) but it still got me the same error...

dkao commented on 2013-09-09 19:16

@drdnl: Increasing that timeout fixed the build for me, thanks!

drdnl commented on 2013-09-09 16:24

Heads up, if you fail certain unit tests with a 'wait' like syntax your system is probably just timing out. Suspending a heavy running process 'fixed' failing the unit test issue for me...

Like this one:
assertion failed: (FsoFramework.Test.wait_for_signal(500, this, "async-test-done", ()

Longer wait?

Anonymous comment on 2013-09-09 13:27

I installed nuvola and I have the html5 audio lab enabled on google music but songs never play. It loads up the first song in the queue or what I have selected but never plays. Am I missing something?


petRUShka commented on 2013-09-01 16:29

@SMOG, I can't reproduce your bug. Could you please leave a bug report on official bug tracker:

SMOG commented on 2013-08-31 21:54

I'm still getting the same error as before, sorry...

petRUShka commented on 2013-08-30 07:23

Package is fixed now. Thank you for pointing on gstreamer bug!

dkao commented on 2013-08-30 06:09

I am getting similar error to SMOG, but inject_to_frame passes. GTK theme is Adwaita so it's got nothing to do with that.
makepkg succeeds when run as root, but I can' figure out what kind of group I would need to be added to, assuming it's as simple as that. Any tips?

jck commented on 2013-08-29 18:48

The PKGBUILD needs to be updated due to the webkitgtk update:

TLDR: add '--with-gstreamer=1.0' to the configure options.

erufenix commented on 2013-08-29 14:25

Solution errror in unit test

Change-gtk theme for Adwaita and rerun

yaourt-S nuvolaplayer

Then return to your regular theme

erufenix commented on 2013-08-29 14:18

Solution errror in unit test

Change-gtk theme for Adwaita and rerun

yaourt-S nuvolaplayer

Then return to your regular theme

erufenix commented on 2013-08-28 15:43

Fail in Unit test

/tmp/yaourt-tmp-erufenix/aur-nuvolaplayer/src/nuvolaplayer-2.1.0/build/tests/bin/main: FAILED
TEST: /tmp/yaourt-tmp-erufenix/aur-nuvolaplayer/src/nuvolaplayer-2.1.0/build/tests/bin/main... (pid=5642)
/ServicesManagerTest/load_service_from_dir: OK
/ServicesManagerTest/list_services_user: OK
/ServicesManagerTest/list_services_system: OK
/ServicesManagerTest/list_services_versioned: OK
/ServicesManagerTest/install_service: OK
/ServicesManagerTest/remove_service: OK
/CachedLyricsTest/store: OK
/CachedLyricsTest/read: OK
/AZLyricsTest/transform_name: OK
/Diorite.SimpleDocBufferTest/parse_errors: OK
/Diorite.SimpleDocBufferTest/parse_basic: OK
/Diorite.SimpleDocBufferTest/close_tag_from_stack: OK
/JSApiTest/keys_exist: FAIL
GTester: last random seed: R02S10fad08a28705117b6911a962e11da06
/JSApiTest/version_info: FAIL
GTester: last random seed: R02S50816f5ffa982aab863c2e73e5d1d251
/JSApiTest/inject_to_frame: FAIL
GTester: last random seed: R02S072e3209fdc1bc369cb48ef5dcaa8719
FAIL: /tmp/yaourt-tmp-erufenix/aur-nuvolaplayer/src/nuvolaplayer-2.1.0/build/tests/bin/main

** (/tmp/yaourt-tmp-erufenix/aur-nuvolaplayer/src/nuvolaplayer-2.1.0/build/tests/bin/main:5642): WARNING **: Can't load fallback CSS resource: Failed to import: El recurso en «/org/gnome/adwaita/gtk-fallback.css» no existe

** (/tmp/yaourt-tmp-erufenix/aur-nuvolaplayer/src/nuvolaplayer-2.1.0/build/tests/bin/main:5670): WARNING **: Can't load fallback CSS resource: Failed to import: El recurso en «/org/gnome/adwaita/gtk-fallback.css» no existe

** (/tmp/yaourt-tmp-erufenix/aur-nuvolaplayer/src/nuvolaplayer-2.1.0/build/tests/bin/main:5675): WARNING **: Can't load fallback CSS resource: Failed to import: El recurso en «/org/gnome/adwaita/gtk-fallback.css» no existe

Glib tests summary
tests that pass 0/1
tests that fail 1/1
Some unit tests failed.
==> ERROR: Se produjo un error en build().

SMOG commented on 2013-08-28 12:38

"nuvolaplayer 2.1.0-1" doesn't compile on my machine... it fails some unit test:

/tmp/yaourt-tmp-fra/aur-nuvolaplayer/src/nuvolaplayer-2.1.0/build/tests/bin/main: FAILED
TEST: /tmp/yaourt-tmp-fra/aur-nuvolaplayer/src/nuvolaplayer-2.1.0/build/tests/bin/main... (pid=1919)
/ServicesManagerTest/load_service_from_dir: OK
/ServicesManagerTest/list_services_user: OK
/ServicesManagerTest/list_services_system: OK
/ServicesManagerTest/list_services_versioned: OK
/ServicesManagerTest/install_service: OK
/ServicesManagerTest/remove_service: OK
/CachedLyricsTest/store: OK
/CachedLyricsTest/read: OK
/AZLyricsTest/transform_name: OK
/Diorite.SimpleDocBufferTest/parse_errors: OK
/Diorite.SimpleDocBufferTest/parse_basic: OK
/Diorite.SimpleDocBufferTest/close_tag_from_stack: OK
/JSApiTest/keys_exist: FAIL
GTester: last random seed: R02Se001a2e7482495fbce3f1b555038fabe
/JSApiTest/version_info: FAIL
GTester: last random seed: R02S36c06cf03fa759874eac94063f9ea05c
/JSApiTest/inject_to_frame: FAIL
GTester: last random seed: R02S3074f87f7729ae37d30067d4ae133a81
FAIL: /tmp/yaourt-tmp-fra/aur-nuvolaplayer/src/nuvolaplayer-2.1.0/build/tests/bin/main

Nuvola:ERROR:tests/main/nuvola-jsapitest.c:323:nuvola_js_api_test_test_keys_exist: assertion failed: (FsoFramework.Test.wait_for_signal(500, this, "async-test-done", () => { web_view.load_html_string("""<html> <head> </head> <body> <p>Text</p> </body> </html>""", "file:///hello.html"); }))
Nuvola:ERROR:tests/main/nuvola-jsapitest.c:420:nuvola_js_api_test_test_version_info: assertion failed: (FsoFramework.Test.wait_for_signal(500, this, "async-test-done", () => { web_view.load_html_string("""<html> <head> </head> <body> <p>Text</p> </body> </html>""", "file:///hello.html"); }))
Nuvola:ERROR:tests/main/nuvola-jsapitest.c:560:nuvola_js_api_test_test_inject_to_frame: assertion failed: (FsoFramework.Test.wait_for_signal(1000, this, "async-test-done", () => { web_view.load_uri(service.resources.get_child("inject_to_frame.html").get_uri()); }))

Glib tests summary
tests that pass 0/1
tests that fail 1/1
Some unit tests failed.

Johnny_Net commented on 2013-08-25 02:33

2.1 is stable

Razor.X commented on 2013-07-10 18:21

Looks the webkitgtk3 has been replaced by webkitgtk.

strugee commented on 2013-07-08 23:49

According to namcap, "GPLv3" isn't a common license. I'm pretty sure it should be changed to "GPL3" (as that's its name in /usr/share/licences/common).

petRUShka commented on 2013-07-08 15:44


Anonymous comment on 2013-07-08 15:34

I had a few problems streaming from the Google Play Music service within nuvola:

It turned out that I was missing the following packages: gst-plugins-base gst-plugins-good gst-plugins-ugly.

Perhaps these should be added as dependencies?

lockheed commented on 2013-05-20 07:57

I can't get it to compile:

[149/149] glibtest: build/nuvolaplayer-tests
Waf: Leaving directory `/tmp/packerbuild-1001/nuvolaplayer/nuvolaplayer/src/nuvolaplayer-2.0.3/build'

/tmp/packerbuild-1001/nuvolaplayer/nuvolaplayer/src/nuvolaplayer-2.0.3/build/nuvolaplayer-tests: FAILED
TEST: /tmp/packerbuild-1001/nuvolaplayer/nuvolaplayer/src/nuvolaplayer-2.0.3/build/nuvolaplayer-tests... (pid=10121)
FAIL: /tmp/packerbuild-1001/nuvolaplayer/nuvolaplayer/src/nuvolaplayer-2.0.3/build/nuvolaplayer-tests

Glib tests summary
tests that pass 0/1
tests that fail 1/1
Some unit tests failed.
==> ERROR: A failure occurred in build().
The build failed.

petRUShka commented on 2013-05-16 05:38


nickread commented on 2013-05-08 02:50

python2-scour doesn't seem to exist

drdnl commented on 2013-05-04 14:16


Sorry for the delay, I've enabled comment notifications

Anyway, output of pacman -Ss gstreamer | grep installed

extra/clutter-gst 2.0.2-2 [installed]
extra/gst-plugins-base 1.0.7-1 [installed]
extra/gst-plugins-base-libs 1.0.7-1 [installed]
extra/gst-plugins-good 1.0.7-1 [installed]
extra/gst-plugins-ugly 1.0.7-1 [installed]
extra/gstreamer 1.0.7-1 [installed]
extra/gstreamer0.10 0.10.36-2 [installed]
extra/gstreamer0.10-bad 0.10.23-3 [installed]
extra/gstreamer0.10-bad-plugins 0.10.23-3 (gstreamer0.10-plugins) [installed]
extra/gstreamer0.10-base 0.10.36-1 [installed]
extra/gstreamer0.10-base-plugins 0.10.36-1 (gstreamer0.10-plugins) [installed]
extra/gstreamer0.10-ffmpeg 0.10.13-1 (gstreamer0.10-plugins) [installed]
extra/gstreamer0.10-good 0.10.31-1 [installed]
extra/gstreamer0.10-good-plugins 0.10.31-1 (gstreamer0.10-plugins) [installed]
extra/gstreamer0.10-ugly 0.10.19-5 [installed]
extra/gstreamer0.10-ugly-plugins 0.10.19-5 (gstreamer0.10-plugins) [installed]

I'd suggest installing all of them, if nothing works at least it's probably not the plugins. (Also, try enabling html5 audio in google music -> settings -> music lab -> set -> save changes)

mrbit commented on 2013-05-04 09:43

please update to 2.0.3 thanks

lockheed commented on 2013-04-28 13:38


thanks for the info. However, I tried removing the player, its folder, and reinstalling it together with gstreamer0.10-good-plugins


What an annoying issue.

drdnl commented on 2013-04-28 11:19


I too didn't have a working Nuvolaplayer, Same bug as

Think (I installed pretty much everything I could find plugin related) I fixed it for me by installing gstreamer0.10-good-plugins.

What I don't entirely understand though, is why doesn't this package have any plugins in its dependencies?

Thanks though, happy to finally have google music again.

petRUShka commented on 2013-04-26 08:19

I've updated package.

4z01235 commented on 2013-04-26 02:07

Sorry for comment spam but it seems that once Nuvola has been exited, it will again freeze up while loading the next time around. Setting all the check boxes in the crash dialog seems to fix the issue most of the time. Otherwise, removing ~/.cache/nuvolaplayer seems to help (maybe Nuvola isn't properly cleaning out the cache every time when that box is checked?). ~/.local/share/nuvolaplayer has not been recreated after I deleted it, not sure what that means. ~/.config/nuvolaplayer also exists but I've never tried removing that, since the checkboxes + rm -rf'ing from .cache seems to "fix" it.

Nuvola Launchpad has an issue about libgee here:

4z01235 commented on 2013-04-26 01:47

Reinstalling Nuvola (added libgee06 to depends, and again, moved json-glib from makedepends to depends), deleted ~/.local/share/nuvolaplayer, relaunched Nuvola and checked all of the boxes on the crash dialog. Working now. Not sure what exactly in there fixed it, but something did.

hexid commented on 2013-04-26 01:38

@4z01235, I had the same problems, but reinstalling the package seemed to fix them.
Note: I tried this with libgee and libgee06 because it won't compile without libgee06 installed.

4z01235 commented on 2013-04-25 02:58

Installing libgee06 does allow Nuvola to launch now, however nuvola freezes when I try to load my Google Play Music library. I have to use "kill -9" to get rid of it, too. Closing it through the WM (OB) doesn't work, launching it in foreground in a terminal and sending Ctrl-C doesn't work... really not good.

Ibex commented on 2013-04-23 15:07

Nuvolaplayer didn't start anymore because the correct libglee wasn't found. Installing libgee06 works fine here.

Anonymous comment on 2013-04-22 02:07

Since libgee was upgraded I can't get this to run. I've tried libgee06 but had no joy.

4z01235 commented on 2013-04-12 15:09

json-glib should be 'depends' not 'makedepends.'

michaudg commented on 2013-04-07 20:50

Had to install "gst-plugins-ugly" for nuvola works with Rdio.

petRUShka commented on 2013-03-10 14:34

Except, nuvolaplayer work with 8traks with errors...

petRUShka commented on 2013-03-10 14:33

@lockheed, in my case nuvolaplayer works fine. If you can discover the problem, please point it to me.

petRUShka commented on 2013-03-10 14:31

About GTK, list of official dependencies:

Libraries (and their C header files in build time):

gee-1.0 >= 0.6
x11 >= 0.5
gtk+-3.0 >= 3.4
gdk-3.0 >= 3.4
libsoup-2.4 >= 2.38
webkitgtk-3.0 >= 1.8
javascriptcoregtk-3.0 >= 1.8
glib-2.0 >= 2.32
gio-2.0 >= 2.32

So I remove libwebkit, thanks :)

lockheed commented on 2013-03-10 09:59

When is Nuvola going to work again on Arch? It has been 5 months already since it stopped.


dmikalova commented on 2013-03-06 04:43

Also libwebkit needs to be replaced with webkitgtk2.

Why does this require GTK 2 and 3 webkit ~_~?

petRUShka commented on 2013-03-02 16:25

@MatejLach, done

MatejLach commented on 2013-03-02 13:13

This PKGBUILD needs to be updated:

replace 'scour' with 'python2-scour'
replace 'libwebkit3' with 'webkitgtk3'

MatejLach commented on 2013-03-02 13:12

This PKGBUILD needs to be updated:

replace 'scour' with 'python2-scour'
replace 'libwebkit3' with 'gtkwebkit3'

petRUShka commented on 2012-11-02 13:27

@gridaphobe, you should send your bug to nuvolaplayer bugtracker:

gridaphobe commented on 2012-10-25 23:33

I'm getting the following error when I try to build nuvolaplayer:

The issue seems to be the undefined reference to `soup_cookie_jar*` in libwebitgtk-3.0, but I haven't (to my knowledge) done anything funny with the webkit package. Has anyone had this problem?

mtorromeo commented on 2012-10-24 12:59

json-glib is not simply a makedepends, it is necessary to run and should be moved to depends

petRUShka commented on 2012-10-15 21:00

json-glib exists as makedependency.

tsocks was added as optdependency

Package was updated to 2.0.1

mtorromeo commented on 2012-10-11 07:05

Missing dependency: json-glib

Anonymous comment on 2012-10-05 08:53

I get the following warning on the console when running nuvolaplayer:

which: no tsocks in ( PATH )

So you should probably add tsocks as a dependency :)

Anonymous comment on 2012-09-29 19:06


if somebody would like to help with testing of a workaround to solve issues with the Flash plugin, you can follow instructions at [1]. The workaround has been already confirmed by Carlos Solís on Arch Linux, but more testing would be appreciated.


Jiří Janoušek, Nuvola Player developer


Anonymous comment on 2012-09-23 15:57

same problem. I solved by installing nspluginweapper and starting "nspluginwrapper -v -n -a -i" as explained in the wiki to get flash working with Epiphany ( However, now it takes a lot of cpu

shadowed87 commented on 2012-09-22 20:38

same problem here with flashplugin not found by grooveshark

c4software commented on 2012-09-22 20:26

@Yegorius I have the same problem. THe flashplugin is correctly installed but in nuvola its seems not recognized.

MatejLach commented on 2012-09-22 10:11

@Yegorius - I'll check if the 'flashplugin' package is linked properly and recogbnized by all browsers (Chrome has a built-in flash, so check in Firefox, Opera & Midori).

MatejLach commented on 2012-09-22 10:11

@Yegorius - I'll check if the 'flashplugin' package is linked properly and recogbnized by all prowsers (Chrome has a built-in flash, so check in Firefox, Opera & Midori).

MatejLach commented on 2012-09-21 21:04

@Yegorius - Stupid question, but do you have 'flashplugin' installed?

Yegorius commented on 2012-09-21 08:54

Does anybody have problems with Flash plugin integration on Grooveshark? It says I don't have Flash plugin installed.

c4software commented on 2012-09-21 07:19


MatejLach commented on 2012-09-20 21:04

Thanks :-)

petRUShka commented on 2012-09-20 20:27

Done ;)

MatejLach commented on 2012-09-20 14:23

I agree with @c4software on Unity.
We don't need dependency support for it, because it is almost impossible to use it outside of Ubuntu, and while some efforts to get it working on Arch do exist, there's nothing usable yet.

c4software commented on 2012-09-20 06:46

We don't have any advantage to build with the unity support. Unity is not even officialy available on Arch. This is why :).

petRUShka commented on 2012-09-20 06:32

Fixed :)

MatejLach commented on 2012-09-19 21:54

The latest version fails to compile for me without 'libwebkit3' and also fails to execute post upgrade commands.

petRUShka commented on 2012-09-19 06:46

What wrong with libunity dependency? Why do you want to get rid of it?

c4software commented on 2012-09-19 06:01

Can you add the flag "--no-unity-quick-list" for the compilation its remove the libunity dependency.

GuestOne commented on 2012-09-18 17:44

Please, update to 2.0.0 version.

Anonymous comment on 2012-09-17 23:59

2.0.0 and 1.1.0 are both stable releases now. Take a look at the launchpad website

petRUShka commented on 2012-09-17 21:46

This package is build from official source tarball. You are talking about beta releases. But developers say that "Source code archives are not provided for beta releases."

Anonymous comment on 2012-09-17 21:38

New release 2.0.0 for GTK+ >= 3.4 and 1.1.0 for older versions

petRUShka commented on 2012-09-02 12:39

It is PKGBUILD for stable release. Please look here ( for bzr-release

Yegorius commented on 2012-07-29 13:53

PKGBUILD for nuvolaplayer 2.0 beta1:

petRUShka commented on 2012-05-20 10:57

willyum, I'm sorry, but I can't help you. I think it is better to ask developers about your trouble:

Anonymous comment on 2012-05-20 03:15

having trouble after installing, can't access any pages: