Package Details: nvidia-utils-full-beta-all 384.59-1

Git Clone URL: https://aur.archlinux.org/nvidia-full-beta-all.git (read-only)
Package Base: nvidia-full-beta-all
Description: NVIDIA driver utilities and libraries for 'nvidia-full-beta-all'
Upstream URL: http://www.nvidia.com/
Keywords: lib32-opencl-driver lib32-vulkan-driver libglvnd nvidia-settings opencl-driver vulkan-driver
Licenses: custom:NVIDIA
Conflicts: libglvnd, nvidia-settings, nvidia-utils
Provides: libglvnd, nvidia-settings=384.59, nvidia-utils=384.59, vulkan-driver
Submitter: Det
Maintainer: Det
Last Packager: Det
Votes: 21
Popularity: 0.078478
First Submitted: 2013-06-27 12:48
Last Updated: 2017-07-24 20:51

Required by (78)

Sources (4)

Latest Comments

ahjolinna commented on 2017-06-29 19:42

as this wont work with linux-ck/lqx but works just fine on the stock kernel, is this driver regression (again) or a pkgbuild problem?

Det commented on 2017-06-29 19:33

Oh alright.

ahjolinna commented on 2017-06-29 19:32

the "illegal" 4.11 patch isn't needed anymore works fine at least with the stock kernel, but with linux-ck(-skylake) and linux-lqx it won't

Det commented on 2017-05-10 12:02

It's supposed to stay disabled. It's something you enable manually and only that one time. If you don't remove lib32-nvidia-utils-full-beta-all, the lib32's will always be updated.

Vash63 commented on 2017-05-10 12:01

Minor issue, looks like the _lib32 flag got disabled on this lib32 version again. I toggled it to 1 and it's working without issue though so no major concern.

Det commented on 2017-05-01 07:32

Added the "illegal" 4.11 patch: https://devtalk.nvidia.com/default/topic/1002820/linux/-patch-381-09-kernel-4-11-rc5/

Det commented on 2017-04-03 07:16

No, it's an unused leftover: https://git.archlinux.org/svntogit/packages.git/tree/trunk/PKGBUILD?h=packages/nvidia

Commander commented on 2017-04-02 21:50

Noticed that the Arch pkg got: https://git.archlinux.org/svntogit/packages.git/tree/trunk/fix-abi.patch?h=packages/nvidia

is this also needed here?

worm2fed commented on 2017-03-15 18:06

This package are trying to install linux-headers, but I have alreade installed linux-pf-headers (not lts). Check dependency list

shoober420 commented on 2017-03-04 22:59

An build error occurs when trying to compile against the linux-zen-git kernel package.

https://aur.archlinux.org/packages/linux-zen-git/

CONFTEST: drm_atomic_available
CONFTEST: drm_atomic_modeset_nonblocking_commit_available
SYMLINK /home/abc/Downloads/packages/nvidia-full-beta-all/src/NVIDIA-Linux-x86_64-378.13/kernel-4.10.1-zen-zen+/nvidia/nv-kernel.o
LD [M] /home/abc/Downloads/packages/nvidia-full-beta-all/src/NVIDIA-Linux-x86_64-378.13/kernel-4.10.1-zen-zen+/nvidia.o
/usr/bin/ld: cannot find /home/abc/Downloads/packages/nvidia-full-beta-all/src/NVIDIA-Linux-x86_64-378.13/kernel-4.10.1-zen-zen+/nvidia/nv-frontend.o: No such file or directory
/usr/bin/ld: cannot find /home/abc/Downloads/packages/nvidia-full-beta-all/src/NVIDIA-Linux-x86_64-378.13/kernel-4.10.1-zen-zen+/nvidia/nv-instance.o: No such file or directory
/usr/bin/ld: cannot find /home/abc/Downloads/packages/nvidia-full-beta-all/src/NVIDIA-Linux-x86_64-378.13/kernel-4.10.1-zen-zen+/nvidia/nv.o: No such file or directory
/usr/bin/ld: cannot find /home/abc/Downloads/packages/nvidia-full-beta-all/src/NVIDIA-Linux-x86_64-378.13/kernel-4.10.1-zen-zen+/nvidia/nv-acpi.o: No such file or directory
/usr/bin/ld: cannot find /home/abc/Downloads/packages/nvidia-full-beta-all/src/NVIDIA-Linux-x86_64-378.13/kernel-4.10.1-zen-zen+/nvidia/nv-chrdev.o: No such file or directory
/usr/bin/ld: cannot find /home/abc/Downloads/packages/nvidia-full-beta-all/src/NVIDIA-Linux-x86_64-378.13/kernel-4.10.1-zen-zen+/nvidia/nv-cray.o: No such file or directory
/usr/bin/ld: cannot find /home/abc/Downloads/packages/nvidia-full-beta-all/src/NVIDIA-Linux-x86_64-378.13/kernel-4.10.1-zen-zen+/nvidia/nv-dma.o: No such file or directory
/usr/bin/ld: cannot find /home/abc/Downloads/packages/nvidia-full-beta-all/src/NVIDIA-Linux-x86_64-378.13/kernel-4.10.1-zen-zen+/nvidia/nv-gvi.o: No such file or directory
/usr/bin/ld: cannot find /home/abc/Downloads/packages/nvidia-full-beta-all/src/NVIDIA-Linux-x86_64-378.13/kernel-4.10.1-zen-zen+/nvidia/nv-i2c.o: No such file or directory
/usr/bin/ld: cannot find /home/abc/Downloads/packages/nvidia-full-beta-all/src/NVIDIA-Linux-x86_64-378.13/kernel-4.10.1-zen-zen+/nvidia/nv-mempool.o: No such file or directory
/usr/bin/ld: cannot find /home/abc/Downloads/packages/nvidia-full-beta-all/src/NVIDIA-Linux-x86_64-378.13/kernel-4.10.1-zen-zen+/nvidia/nv-mmap.o: No such file or directory
/usr/bin/ld: cannot find /home/abc/Downloads/packages/nvidia-full-beta-all/src/NVIDIA-Linux-x86_64-378.13/kernel-4.10.1-zen-zen+/nvidia/nv-p2p.o: No such file or directory
/usr/bin/ld: cannot find /home/abc/Downloads/packages/nvidia-full-beta-all/src/NVIDIA-Linux-x86_64-378.13/kernel-4.10.1-zen-zen+/nvidia/nv-pat.o: No such file or directory
/usr/bin/ld: cannot find /home/abc/Downloads/packages/nvidia-full-beta-all/src/NVIDIA-Linux-x86_64-378.13/kernel-4.10.1-zen-zen+/nvidia/nv-procfs.o: No such file or directory
/usr/bin/ld: cannot find /home/abc/Downloads/packages/nvidia-full-beta-all/src/NVIDIA-Linux-x86_64-378.13/kernel-4.10.1-zen-zen+/nvidia/nv-usermap.o: No such file or directory
/usr/bin/ld: cannot find /home/abc/Downloads/packages/nvidia-full-beta-all/src/NVIDIA-Linux-x86_64-378.13/kernel-4.10.1-zen-zen+/nvidia/nv-vm.o: No such file or directory
/usr/bin/ld: cannot find /home/abc/Downloads/packages/nvidia-full-beta-all/src/NVIDIA-Linux-x86_64-378.13/kernel-4.10.1-zen-zen+/nvidia/nv-vtophys.o: No such file or directory
/usr/bin/ld: cannot find /home/abc/Downloads/packages/nvidia-full-beta-all/src/NVIDIA-Linux-x86_64-378.13/kernel-4.10.1-zen-zen+/nvidia/os-interface.o: No such file or directory
/usr/bin/ld: cannot find /home/abc/Downloads/packages/nvidia-full-beta-all/src/NVIDIA-Linux-x86_64-378.13/kernel-4.10.1-zen-zen+/nvidia/os-mlock.o: No such file or directory
/usr/bin/ld: cannot find /home/abc/Downloads/packages/nvidia-full-beta-all/src/NVIDIA-Linux-x86_64-378.13/kernel-4.10.1-zen-zen+/nvidia/os-pci.o: No such file or directory
/usr/bin/ld: cannot find /home/abc/Downloads/packages/nvidia-full-beta-all/src/NVIDIA-Linux-x86_64-378.13/kernel-4.10.1-zen-zen+/nvidia/os-registry.o: No such file or directory
/usr/bin/ld: cannot find /home/abc/Downloads/packages/nvidia-full-beta-all/src/NVIDIA-Linux-x86_64-378.13/kernel-4.10.1-zen-zen+/nvidia/os-usermap.o: No such file or directory
/usr/bin/ld: cannot find /home/abc/Downloads/packages/nvidia-full-beta-all/src/NVIDIA-Linux-x86_64-378.13/kernel-4.10.1-zen-zen+/nvidia/nv-modeset-interface.o: No such file or directory
/usr/bin/ld: cannot find /home/abc/Downloads/packages/nvidia-full-beta-all/src/NVIDIA-Linux-x86_64-378.13/kernel-4.10.1-zen-zen+/nvidia/nv-pci-table.o: No such file or directory
/usr/bin/ld: cannot find /home/abc/Downloads/packages/nvidia-full-beta-all/src/NVIDIA-Linux-x86_64-378.13/kernel-4.10.1-zen-zen+/nvidia/nv-kthread-q.o: No such file or directory
/usr/bin/ld: cannot find /home/abc/Downloads/packages/nvidia-full-beta-all/src/NVIDIA-Linux-x86_64-378.13/kernel-4.10.1-zen-zen+/nvidia/nv-kthread-q-selftest.o: No such file or
directory
/usr/bin/ld: cannot find /home/abc/Downloads/packages/nvidia-full-beta-all/src/NVIDIA-Linux-x86_64-378.13/kernel-4.10.1-zen-zen+/nvidia/nv_uvm_interface.o: No such file or directory
/usr/bin/ld: cannot find /home/abc/Downloads/packages/nvidia-full-beta-all/src/NVIDIA-Linux-x86_64-378.13/kernel-4.10.1-zen-zen+/nvidia/nvlink_linux.o: No such file or directory
/usr/bin/ld: cannot find /home/abc/Downloads/packages/nvidia-full-beta-all/src/NVIDIA-Linux-x86_64-378.13/kernel-4.10.1-zen-zen+/nvidia/nvlink_pci.o: No such file or directory
/usr/bin/ld: cannot find /home/abc/Downloads/packages/nvidia-full-beta-all/src/NVIDIA-Linux-x86_64-378.13/kernel-4.10.1-zen-zen+/nvidia/ebridge_linux.o: No such file or directory
/usr/bin/ld: cannot find /home/abc/Downloads/packages/nvidia-full-beta-all/src/NVIDIA-Linux-x86_64-378.13/kernel-4.10.1-zen-zen+/nvidia/ibmnpu_linux.o: No such file or directory
make[2]: *** [scripts/Makefile.build:540: /home/abc/Downloads/packages/nvidia-full-beta-all/src/NVIDIA-Linux-x86_64-378.13/kernel-4.10.1-zen-zen+/nvidia.o] Error 1
make[1]: *** [Makefile:1500: _module_/home/abc/Downloads/packages/nvidia-full-beta-all/src/NVIDIA-Linux-x86_64-378.13/kernel-4.10.1-zen-zen+] Error 2
make[1]: Leaving directory '/usr/src/linux-4.10.1-zen-zen+'
make: *** [Makefile:81: modules] Error 2
==> ERROR: A failure occurred in build().
Aborting...

All comments