Package Details: onivim2 0.5.6-1

Git Clone URL: https://aur.archlinux.org/onivim2.git (read-only, click to copy)
Package Base: onivim2
Description: Native, lightweight modal code editor
Upstream URL: https://github.com/onivim/oni2
Keywords: code editor lightweight modal
Licenses: custom:OutrunLabsEULA
Submitter: freswa
Maintainer: None
Last Packager: thebiblelover7
Votes: 5
Popularity: 0.000039
First Submitted: 2020-01-04 13:38 (UTC)
Last Updated: 2021-08-20 05:18 (UTC)

Latest Comments

1 2 Next › Last »

slococo commented on 2022-03-15 14:43 (UTC)

@nesper8 if you have data caps, you can download onivim2-bin.

nesper8 commented on 2022-01-29 14:37 (UTC)

Anyone have a pre-built zst of this package for those with data caps

adrinux commented on 2021-09-30 16:40 (UTC)

Build maxed out at 25Gigs on my system but at least Onivim2 now runs unlike the pre-built AppImage provided by Oni at the moment. Thank you @thebiblelover7

gyara commented on 2021-09-08 08:44 (UTC)

Seems missing git and curl in make depends?

slococo commented on 2021-08-06 01:35 (UTC) (edited on 2021-08-06 01:36 (UTC) by slococo)

Hi im having a build error.

error unable to fetch @opam/menhirLib@opam:20201216:
                                                      source: archive:https://gitlab.inria.fr/fpottie
                                                      error: error: md5 checksum mismatch: expected f
                                                               fetching dist: archive:https://gitlab.
2d9130fced49
                                                      source: archive:https://opam.ocaml.org/cache/md
                                                      error: error: error running curl: 'curl' '--sil
' 'https://opam.ocaml.org/cache/md5/f2/f27f8f5dedd316eff4c02d9130fced49' '--output' '/home/username/.c
-out' '\n%{http_code}':
                                                             code: 200
                                                             stderr:

                                                               fetching dist: archive:https://opam.oc
fced49
error unable to fetch @opam/fix@opam:20201120:
                                                source: archive:https://gitlab.inria.fr/fpottier/fix/
                                                error: error: md5 checksum mismatch: expected 7eb570b
                                                         fetching dist: archive:https://gitlab.inria.
8e3
                                                source: archive:https://opam.ocaml.org/cache/md5/7e/7
                                                error: error: error running curl: 'curl' '--silent' '
ps://opam.ocaml.org/cache/md5/7e/7eb570b759635fe66f3556d2b1cc88e3' '--output' '/home/username/.cache/p
'\n%{http_code}':
                                                       code: 200
                                                       stderr:

                                                         fetching dist: archive:https://opam.ocaml.or
error unable to fetch @opam/menhir@opam:20201216:
                                                   source: archive:https://gitlab.inria.fr/fpottier/m
                                                   error: error: md5 checksum mismatch: expected f27f
                                                            fetching dist: archive:https://gitlab.inr
130fced49
                                                   source: archive:https://opam.ocaml.org/cache/md5/f
                                                   error: error: error running curl: 'curl' '--silent
https://opam.ocaml.org/cache/md5/f2/f27f8f5dedd316eff4c02d9130fced49' '--output' '/home/username/.cach
t' '\n%{http_code}':
                                                          code: 200
                                                          stderr:

                                                            fetching dist: archive:https://opam.ocaml
d49
error: installation error
  fetching @opam/fix@opam:20201120
esy: exiting due to errors above
==> ERROR: A failure occurred in build().
    Aborting...
error: failed to build 'onivim2-0.5.4-1':
error: packages failed to buid: onivim2-0.5.4-1

AkechiShiro commented on 2021-04-30 02:18 (UTC) (edited on 2021-04-30 02:21 (UTC) by AkechiShiro)

Hi, again

I'm still hitting a build error, this time I believe the build is either broken upstream or the PKGBUILD needs changes.

info esy build 0.6.7 (using package.json)
   generator src/Core/BuildInfo.re (exit 2)
(cd /home/username/downloads/todelete/onivim2/src/oni2-0.5.4/_esy/default/store/b/oni2-61458027/default/src/Core && ../gen_buildinfo/generator.exe)
fatal: not a git repository (or any parent up to mount point /)
Stopping at filesystem boundary (GIT_DISCOVERY_ACROSS_FILESYSTEM not set).
Fatal error: exception End_of_file
    discover src/reason-oniguruma/c_flags.sexp,src/reason-oniguruma/cxx_flags.sexp,src/reason-oniguruma/flags.sexp
/home/username/downloads/todelete/onivim2/src/esy_cache/3_________________________________/i/esy_oniguruma-c0ee1673/include
/home/username/downloads/todelete/onivim2/src/esy_cache/3_________________________________/i/esy_oniguruma-c0ee1673/lib
    discover src/reason-libvim/c_flags.sexp,src/reason-libvim/cxx_flags.sexp,src/reason-libvim/flags.sexp
-L/home/username/downloads/todelete/onivim2/src/esy_cache/3_________________________________/i/libvim-8.10869.85-d288eee9/lib
    discover src/reason-tree-sitter/c_flags.sexp,src/reason-tree-sitter/cxx_flags.sexp,src/reason-tree-sitter/flags.sexp
/home/username/downloads/todelete/onivim2/src/esy_cache/3_________________________________/i/esy_tree_sitter-1.4.1-343c5c79/include
/home/username/downloads/todelete/onivim2/src/esy_cache/3_________________________________/i/esy_tree_sitter-1.4.1-343c5c79/lib
error: command failed: 'refmterr' 'dune' 'build' '-p' 'libvim,textmate,treesitter,Oni2' '-j4' (exited with 1)
esy-build-package: exiting with errors above...
error: build failed with exit code: 1

esy: exiting due to errors above
==> ERROR: A failure occurred in build().
    Aborting...

AkechiShiro commented on 2021-04-29 18:32 (UTC) (edited on 2021-04-29 18:38 (UTC) by AkechiShiro)

Hm I'm a bit puzzled I have 50GB of free space and I ran into this error during the build, I'm going to retry again and look at my free space during the build process.

    (cd _build/default/src/c/vendor/libuv && /usr/bin/bash -e -u -o pipefail -c '$([ '\''Unix'\'' = Unix ] && echo /usr/bin/make || echo make) V=0 -j 4 -o aclocal.m4 -o Makefile.in -o configure -o configure.status -o Makefile libuv.la' &> /dev/null
    Fatal error: exception Sys_error("No space left on device")
    Raised by primitive operation at file "stdlib.ml", line 385, characters 19-27
    Called from file "src/stdune/exn.ml", line 15, characters 4-13
    Called from file "list.ml", line 110, characters 12-15
    Called from file "stdlib.ml", line 553, characters 62-65
    Called from file "stdlib.ml" (inlined), line 556, characters 20-39
    Called from file "stdlib.ml", line 559, characters 2-15
    Called from file "bin/main.ml", line 265, characters 19-25
    error: command failed: 'dune' 'build' '-p' 'luv' '-j' '4' (exited with 2)
    esy-build-package: exiting with errors above...

  building @opam/luv@github:bryphe/luv:luv.opam#8e9f2b0
esy: exiting due to errors above
==> ERROR: A failure occurred in build().
    Aborting...
aura >>= There was a makepkg failure.

Edit: The problem comes from the fact that my /tmp partition has only 8GB of free space, going to download the PKGBUILD file and build it in my /home partition which has more free space...

gbaranski commented on 2021-04-17 12:56 (UTC)

Hello, please add unzip dev-dependency, it fails to build without it.

infabo commented on 2021-02-09 13:27 (UTC) (edited on 2021-02-09 13:31 (UTC) by infabo)

Despite having bought a license for onivim, I won't use this editor anymore until a binary package is available. I dislike to download an AppImage manually. The compilation process exceeds the 8GB /tmp folder I have configured on my Manjaro machine. This is ridiculous, that you need 22gb of free space to build "a super fast and minimal editor".

mage commented on 2020-11-21 05:50 (UTC)

On my machine this pkg takes approx 22G of free space to build