Package Details: onlyoffice-documentserver 5.4.0-1

Git Clone URL: https://aur.archlinux.org/onlyoffice-documentserver.git (read-only)
Package Base: onlyoffice-documentserver
Description: Online office suite comprising viewers and editors for texts, spreadsheets and presentations
Upstream URL: https://github.com/ONLYOFFICE/DocumentServer
Licenses: AGPL
Submitter: onny
Maintainer: onny
Last Packager: onny
Votes: 4
Popularity: 0.000575
First Submitted: 2017-07-20 08:47
Last Updated: 2019-09-04 10:46

Dependencies (17)

Required by (0)

Sources (15)

Latest Comments

1 2 3 Next › Last »

notEvil commented on 2019-10-13 13:23

Can someone explain shortly how post_install() works? Afaik post_install is called before pacman processes its hooks (which create the user onlyoffice).

notEvil commented on 2019-10-03 11:32

Build fails due to https://github.com/ONLYOFFICE/DocumentServer/issues/656 which is fixed for 5.4.1. please update

PedroHLC commented on 2019-09-01 19:57

@onny Thank you very much!

onny commented on 2019-09-01 14:54

I fixed it using an older version of nodejs. PKGBUILD updated.

PedroHLC commented on 2019-08-30 10:28

@smirky your error is actually the same as mine, you have to search for the "error" keyword to find them in the console output. It's probably a version mismatch with spell checker and v8.

smirky commented on 2019-08-30 09:05

And this is what I got from the makepkg output:

make[1]: *** [nodehun.target.mk:112: Release/obj.target/nodehun/src/nodehun.o] Error 1
make[1]: Leaving directory '/mnt/sdc/onlyoffice-documentserver/src/DocumentServer-ONLYOFFICE-DocumentServer-5.3.4/server/build/server/SpellChecker/node_modules/nodehun/build'
gyp ERR! build error
gyp ERR! stack Error: make failed with exit code: 2
gyp ERR! stack     at ChildProcess.onExit (/usr/lib/node_modules/node-gyp/lib/build.js:190:23)
gyp ERR! stack     at ChildProcess.emit (events.js:209:13)
gyp ERR! stack     at Process.ChildProcess._handle.onexit (internal/child_process.js:272:12)
gyp ERR! System Linux 5.3.0-rc6-mainline
gyp ERR! command "/usr/bin/node" "/usr/lib/node_modules/node-gyp/bin/node-gyp.js" "rebuild"
gyp ERR! cwd /mnt/sdc/onlyoffice-documentserver/src/DocumentServer-ONLYOFFICE-DocumentServer-5.3.4/server/build/server/SpellChecker/node_modules/nodehun
gyp ERR! node -v v12.9.0
gyp ERR! node-gyp -v v5.0.2
gyp ERR! not ok
npm ERR! code ELIFECYCLE
npm ERR! errno 1
npm ERR! nodehun@2.0.12 install: node-gyp rebuild
npm ERR! Exit status 1
npm ERR!
npm ERR! Failed at the nodehun@2.0.12 install script.
npm ERR! This is probably not a problem with npm. There is likely additional logging output above.

npm ERR! A complete log of this run can be found in: npm ERR! /home/smirky/.npm/_logs/2019-08-30T08_47_27_522Z-debug.log

npm install failed with code: 1 Warning: Task "checkDependencies:./build/server/SpellChecker" failed. Use --force to continue.

Aborted due to warnings. make: *** [Makefile:155: Gruntfile.js.out] Error 3 ==> ERROR: A failure occurred in build(). Aborting...

smirky commented on 2019-08-30 07:49

I fail to build the package. I did get a reference to an NPM log after it failed, but I can't figure out it's problem: https://paste.smirky.net/view/raw/4160a816

PedroHLC commented on 2019-08-27 11:28

Since last update, these two repeats a lot in ../src/post0.12.0/nodehun.cpp:

error: no matching function for call to ‘v8::Value::ToString()’
error: no matching function for call to v8::Function::Call(v8::Local<v8::Object>, const unsigned int&, v8::Local<v8::Value> [2])’

Ending with:

>> npm install failed with code: 1
Warning: Task "checkDependencies:./build/server/SpellChecker" failed. Use --force to continue.

VVL commented on 2019-06-01 09:18

solved this error: it's server_makefile.patch mistake - need to edit

@@ -173,36 +173,36 @@

But found new error, which dont know how to fix:

/usr/bin/ld: cannot find -lv8_base
/usr/bin/ld: cannot find -lv8_libplatform
/usr/bin/ld: cannot find -lv8_libbase
/usr/bin/ld: cannot find -lv8_snapshot
/usr/bin/ld: cannot find -lv8_libsampler
collect2: error: ld exited with code error 1

VVL commented on 2019-05-30 22:06

at 5.3.0:

patching file server/Makefile

patch: **** malformed patch at line 55: