Package Details: opa-git 4308.r80.g63f1cda-1

Git Clone URL: https://aur.archlinux.org/opa-git.git (read-only)
Package Base: opa-git
Description: A new generation of open source web development framework for JavaScript
Upstream URL: https://github.com/MLstate/opalang/
Licenses: MIT, AGPL3
Groups: devel
Conflicts: opa
Provides: opa
Submitter: Franek
Maintainer: dseg
Last Packager: dseg
Votes: 4
Popularity: 0.000000
First Submitted: 2011-07-31 11:00
Last Updated: 2015-06-09 09:23

Latest Comments

MikaXII commented on 2016-01-12 08:05

Hi,
I don't find any package that replace ulex/ocaml-ulex.
maybe try this https://github.com/MLstate/opalang/wiki/Building-Opa#alternative ?

vnoel commented on 2015-11-20 09:34

Hi, apparently the dependencies ocaml-ulex does not exist…

dseg commented on 2014-03-28 02:47

@tuusjr Hi,
>gcc: error: /usr/lib/ocaml/ulex/ulexing.a: No such file or directory
>gcc: error: /usr/lib/ocaml/camlzip/zip.a: No such file or directory
>gcc: error: /usr/lib/ocaml/ocamlgraph/graph.a: No such file or directory
Could you check these files really exists?
Since Mar 2013, pacman's default packaging policy has changed, maybe you don't have any of above static libraries on your system.
# Please see following url and thread:
# https://mailman.archlinux.org/pipermail/arch-dev-public/2013-May/025002.html

To install the static libraries required by opa-git, please follow these steps for example.

$ echo 'OPTIONS=(staticlibs)' >> ~/.makepkg.conf
$ yaourt -S --noconfirm ocaml-zip ocaml-ocamlgraph ocaml-ulex

tuusjr commented on 2014-02-07 18:26

Cannot compile:


Checking for ulex... ocamlfind:/usr/lib/ocaml/ulex, could not compile
----------
+ /usr/bin/ocamlopt.opt unix.cmxa -g -I /usr/lib/ocaml/ulex ulexing.cmxa check_ulexing.cmx -o check_ulexing.native
gcc: error: /usr/lib/ocaml/ulex/ulexing.a: No such file or directory
File "caml_startup", line 1:
Error: Error during linking
Command exited with code 2.
----------
The installation of ulexing seems broken, please fix it (did it come with a different ocaml compiler ?)
Checking for camlzip... ocamlfind:/usr/lib/ocaml/camlzip, could not compile
----------
+ /usr/bin/ocamlopt.opt unix.cmxa -g -I /usr/lib/ocaml/camlzip zip.cmxa check_zip.cmx -o check_zip.native
gcc: error: /usr/lib/ocaml/camlzip/zip.a: No such file or directory
File "caml_startup", line 1:
Error: Error during linking
Command exited with code 2.
----------
The installation of zip seems broken, please fix it (did it come with a different ocaml compiler ?)
Checking for ocamlgraph... ocamlfind:/usr/lib/ocaml/ocamlgraph, could not compile
----------
+ /usr/bin/ocamlopt.opt unix.cmxa -g -I /usr/lib/ocaml/ocamlgraph graph.cmxa check_graph.cmx -o check_graph.native
gcc: error: /usr/lib/ocaml/ocamlgraph/graph.a: No such file or directory
File "caml_startup", line 1:
Error: Error during linking
Command exited with code 2.
----------
The installation of graph seems broken, please fix it (did it come with a different ocaml compiler ?)

Not configured. You need the following libraries installed:
- ulex (might be found in package ocaml-ulex)
- camlzip (might be found in package libzip-ocaml-dev)
- ocamlgraph (might be found in package libocamlgraph-ocaml-dev)

dseg commented on 2013-01-01 07:28

@tdy Thank you, updated the pkgbuild.

tdy commented on 2013-01-01 04:11

opa actually uses these licenses:
license=('AGPL3' 'MIT')

and the MIT license should be installed:
install -Dm644 LICENSE "$pkgdir/usr/share/licenses/$pkgname/LICENSE"

exterm commented on 2012-08-02 10:34

error: the env var "MLSTATELIBS" is not defined

exterm commented on 2012-08-01 17:50

I have created an opa-bin package that seems to work for x64. I suspect I forgot some dependencies, please report.

https://aur.archlinux.org/packages.php?ID=61389

Franek commented on 2012-08-01 12:26

exterm, you seem to be right about the nodejs dependency. Fixed.

However, I am now getting a build error different from yours, suggesting that I should build with "--parser js-like". However, I have not been able to figure out where to put this option (does not work with configure or make), and as I am not using Opa at the moment, I am unwilling to pursue this issue further.

I am orphaning this package for now. Anyone, feel free to take over.

exterm commented on 2012-07-31 09:20

build fails with
cc -march=x86-64 -mtune=generic -O2 -pipe -fstack-protector --param=ssp-buffer-size=4 -D_FORTIFY_SOURCE=2 -Wl,-O1,--sort-common,--as-needed,-z,relro tools/maxmem.c -o tools/maxmem
tools/maxmem.c: In function ‘main’:
tools/maxmem.c:18:17: error: storage size of ‘rus’ isn’t known
make: *** [tools/maxmem] Error

All comments