Package Details: opencv2-opt-samples

Git Clone URL: (read-only)
Package Base: opencv2-opt
Description: Open Source Computer Vision Library (Legacy Version & /opt directory version) (samples)
Upstream URL:
Licenses: BSD
Provides: opencv2-samples
Submitter: dracorp
Maintainer: hottea
Last Packager: hottea
Votes: 8
Popularity: 0.050008
First Submitted: 2016-10-22 23:27
Last Updated: 2018-07-19 14:28

Latest Comments

1 2 Next › Last »

postadelmaga commented on 2018-08-29 07:18

now It compiles.

dracorp commented on 2018-06-21 21:20

Hi, I've disowned package, because I don't have enough time to take care of it.

kova7ev commented on 2018-06-20 10:41

If you don't need ffmpeg dependencies you can disable it by adding in your CMAKE this option: -D WITH_FFMPEG=OFF

postadelmaga commented on 2018-06-20 07:46

Any workaround ? How can I try using ffmpeg2.8 ?

AsGreyWolf commented on 2018-05-29 03:34

Try using ffmpeg2.8.

dracorp commented on 2018-05-22 15:19

The same problem is for opencv2

postadelmaga commented on 2018-05-22 05:39

Same here, built fails at 10%

[ 10%] Building CXX object modules/highgui/CMakeFiles/opencv_highgui.dir/src/cap_ffmpeg.cpp.o

dreieck commented on 2018-05-17 11:32

Build fails for me, too:

In file included from /var/tmp/yaourt-tmp-felics/aur-opencv2-opt/src/opencv-
/var/tmp/yaourt-tmp-felics/aur-opencv2-opt/src/opencv- In static member function ‘static AVStream* OutputMediaStream_FFMPEG::addVideoStream(AVFormatContext*, AVCodecID, int, int, int, double, AVPixelFormat)’:
/var/tmp/yaourt-tmp-felics/aur-opencv2-opt/src/opencv- error: ‘CODEC_FLAG_GLOBAL_HEADER’ was not declared in this scope
             c->flags |= CODEC_FLAG_GLOBAL_HEADER;
/var/tmp/yaourt-tmp-felics/aur-opencv2-opt/src/opencv- note: suggested alternative: ‘AV_CODEC_FLAG_GLOBAL_HEADER’
             c->flags |= CODEC_FLAG_GLOBAL_HEADER;
make[2]: *** [modules/highgui/CMakeFiles/opencv_highgui.dir/build.make:180: modules/highgui/CMakeFiles/opencv_highgui.dir/src/cap_ffmpeg.cpp.o] Error 1
make[1]: *** [CMakeFiles/Makefile2:952: modules/highgui/CMakeFiles/opencv_highgui.dir/all] Error 2
make: *** [Makefile:163: all] Error 2
==> ERROR: A failure occurred in build().

kolorafa commented on 2018-05-17 09:50

Can't compile, problems around ffmpeg variable names on latest Arch.

orion78fr commented on 2018-02-09 17:43

I don't know if it's of any use for you :

==> Checking for packaging issue... ==> WARNING: Package contains reference to $srcdir