Package Details: openscad-git 20171107-1

Git Clone URL: https://aur.archlinux.org/openscad-git.git (read-only)
Package Base: openscad-git
Description: The programmers solid 3D CAD modeller
Upstream URL: http://openscad.org/
Licenses: GPL2
Conflicts: openscad
Provides: openscad
Submitter: None
Maintainer: keenerd
Last Packager: keenerd
Votes: 11
Popularity: 0.159516
First Submitted: 2011-02-25 03:29
Last Updated: 2017-11-10 00:42

Latest Comments

daijizai commented on 2017-11-09 14:43

add depends ccache

make: ccache: Command not found
make: *** [Makefile:1700: objects/scintillaeditor.o] Error 127
==> ERROR: A failure occurred in build().
Aborting...
==> ERROR: Makepkg was unable to build openscad-git

keenerd commented on 2017-06-07 18:41

Please learn how to use the AUR. You are responsible for rebuilding any unofficial packages installed.

https://wiki.archlinux.org/index.php/Arch_User_Repository

xoan commented on 2017-06-07 17:44

Rebuild is needed due cgal (4.9.1 -> 4.10) update:

openscad: error while loading shared libraries: libCGAL.so.12: cannot open shared object file: No such file or directory

keenerd commented on 2017-02-25 14:45

Builds find here.

heczis commented on 2017-01-10 09:05

In build, I get stuff like this:

handle_dep.cc:(.text._ZN5boost16re_detail_10610012perl_matcherIN9__gnu_cxx17__normal_iteratorIPKcNSt7__cxx1112basic_stringIcSt11char_traitsIcESaIcEEEEESaINS_9sub_matchISC_EEENS_12regex_traitsIcNS_16cpp_regex_traitsIcEEEEE12extend_stackEv[_ZN5boost16re_detail_10610012perl_matcherIN9__gnu_cxx17__normal_iteratorIPKcNSt7__cxx1112basic_stringIcSt11char_traitsIcESaIcEEEEESaINS_9sub_matchISC_EEENS_12regex_traitsIcNS_16cpp_regex_traitsIcEEEEE12extend_stackEv]+0x18): undefined reference to `boost::re_detail_106100::get_mem_block()'
collect2: error: ld returned 1 exit status
make: *** [Makefile:876: openscad] Error 1

sl1pkn07 commented on 2016-12-26 18:03

openscad-git E: Dependency libzip detected and not included (libraries ['usr/lib/libzip.so.4'] needed in files ['usr/bin/openscad'])

gregor commented on 2015-12-14 17:25

i tried to install but i get the following:

...
yacc -d -p parser -b parser src/parser.y
make: yacc: Command not found
Makefile:1201: recipe for target 'parser_yacc.h' failed
make: *** [parser_yacc.h] Error 127
==> ERROR: A failure occurred in build().

UPDATE: bison was missing. somebody should add it to the dependencies

keenerd commented on 2015-05-31 13:12

Doesn't run entirely fine, you will occasionally get large black squares over the UI. But now you can help debug those.

stevenhoneyman commented on 2015-05-23 12:00

Please update to qt5. It's supported and compiles and runs fine without any modifications needed.

yar commented on 2014-09-23 22:59

Looks like this needs to depend on 'qscintilla'.

All comments