Package Details: opensees 2.5.0-1

Git Clone URL: https://aur.archlinux.org/opensees.git (read-only)
Package Base: opensees
Description: OpenSees, a software framework for developing applications to simulate the performance of structural and geotechnical systems subjected to earthquakes
Upstream URL: http://opensees.berkeley.edu/
Licenses: custom
Submitter: mickele
Maintainer: mickele
Last Packager: mickele
Votes: 3
Popularity: 0.000000
First Submitted: 2009-09-27 14:15
Last Updated: 2016-05-03 21:39

Latest Comments

bojurama commented on 2016-05-22 16:57

@nema.arpit: Thank you very much for your help. Compilation worked with gcc 5.3.

nema.arpit commented on 2016-05-21 02:49

@bojurama: That is an issue with gcc 6.1.1, I think. You can get past the error by adding the suggested flag, but then the compilation gets stuck in confinedConcrete01.cpp.
It compiles well with gcc 5.3.0, so you can try that out.

bojurama commented on 2016-05-20 23:50

OpenSees won't compile on my machine. The first error I get is the following one:

/usr/include/c++/6.1.1/type_traits:120:12: erreur fatale : template instantiation depth exceeds maximum of 30 (use -ftemplate-depth= to increase the maximum)
struct __or_<_B1, _B2>
^~~~~~~~~~~~~~~
compilation terminée.
../../../../Makefile.def:280 : la recette pour la cible « UmfpackGenLinSOE.o » a échouée
make[4]: *** [UmfpackGenLinSOE.o] Erreur 1
make[4] : on quitte le répertoire « /tmp/packerbuild-1000/opensees/opensees/src/OpenSees/SRC/system_of_eqn/linearSOE/umfGEN »
Makefile:7 : la recette pour la cible « all » a échouée

nema.arpit commented on 2016-01-31 09:22

Needs gcc-fortran as a dependency during make? Although, it is kinda expected to be installed if you are doing any serious scientific computations.

mickele commented on 2013-05-04 16:30

At last I updated the package!
I encountered some problems with the source.

mickele commented on 2011-12-26 12:29

Source of 2.3.2 isn't available as a tarball, so we have to donwload from SVN.

mickele commented on 2011-01-08 21:47

Updated to 2.2.2!

Anonymous comment on 2010-06-12 07:56

there is a new version!!!

mickele commented on 2010-05-21 21:07

@ faco

I should have solved your issues. It was caused by gcc-4.5.

Anonymous comment on 2010-05-21 16:10

I have problems compiling this software. I need opensees for my thesis and I don't want to use it on windows if I can do this on linux.

ContactMaterial2D.cpp: En la función ‘void* OPS_NewContactMaterial2DMaterial()’:
ContactMaterial2D.cpp:31:112: aviso: conversión obsoleta de una constante de cadena a ‘char*’
ContactMaterial2D.cpp: En el constructor ‘ContactMaterial2D::ContactMaterial2D()’:

ContactMaterial2D.cpp:91:68: error: no se puede llamar directamente al constructor ‘ContactMaterial2D::ContactMaterial2D’
ContactMaterial2D.cpp:91:68: error: para una conversión de estilo de función, borre el ‘::ContactMaterial2D’ redundante
make[3]: *** [ContactMaterial2D.o] Error 1
make[3]: se sale del directorio `/home/felipe/Downloads/opensees/src/OpenSees/SRC/material/nD'
make[2]: *** [all] Error 2
make[2]: se sale del directorio `/home/felipe/Downloads/opensees/src/OpenSees/SRC/material'
make[1]: *** [all] Error 2
make[1]: se sale del directorio `/home/felipe/Downloads/opensees/src/OpenSees/SRC'
make[1]: se ingresa al directorio `/home/felipe/Downloads/opensees/src/OpenSees/OTHER/METIS'
make[1]: se sale del directorio `/home/felipe/Downloads/opensees/src/OpenSees/OTHER/METIS'
LIBRARIES BUILT ... NOW LINKING OpenSees PROGRAM
make[1]: se ingresa al directorio `/home/felipe/Downloads/opensees/src/OpenSees/SRC/tcl'
make[1]: No se hace nada para `tcl'.
make[1]: se sale del directorio `/home/felipe/Downloads/opensees/src/OpenSees/SRC/tcl'
make[1]: se ingresa al directorio `/home/felipe/Downloads/opensees/src/OpenSees/SRC/modelbuilder/tcl'
Makefile:21: atención: se imponen comandos para el objetivo `tcl'
Makefile:13: atención: se ignoran las instrucciones viejas para el objetivo `tcl'
make[2]: se ingresa al directorio `/home/felipe/Downloads/opensees/src/OpenSees/SRC/tcl'
make[2]: No se hace nada para `tcl'.
make[2]: se sale del directorio `/home/felipe/Downloads/opensees/src/OpenSees/SRC/tcl'
g++: /home/felipe/Downloads/opensees/src/lib/libOpenSees.a: No existe el fichero o el directorio
g++: /home/felipe/Downloads/opensees/src/lib/libReliability.a: No existe el fichero o el directorio
make[1]: *** [tcl] Error 1
make[1]: se sale del directorio `/home/felipe/Downloads/opensees/src/OpenSees/SRC/modelbuilder/tcl'
make: *** [all] Error 2
==> ERROR: Falló la compilación.
Abortando...

Any help?

mickele commented on 2010-04-19 21:28

Ok! In the next days I'll work on the update.