Package Details: openucx 1.13.1-2

Git Clone URL: https://aur.archlinux.org/openucx.git (read-only, click to copy)
Package Base: openucx
Description: Unified Communication X (http://www.openucx.org)
Upstream URL: http://www.openucx.org
Licenses: BSD
Submitter: vmaffione
Maintainer: vmaffione
Last Packager: vmaffione
Votes: 3
Popularity: 0.012080
First Submitted: 2018-10-31 11:26 (UTC)
Last Updated: 2022-09-18 15:09 (UTC)

Latest Comments

vmaffione commented on 2022-08-24 08:57 (UTC)

Patch applied

jedbrown commented on 2022-08-15 15:45 (UTC)

This is caused by a binutils-2.39 change. The package can work around it by applying this patch or a sed one-liner. https://github.com/openucx/ucx/pull/8450

vmaffione commented on 2022-08-10 07:33 (UTC)

I guess you should report this issue upstream: https://github.com/openucx/ucx

jedbrown commented on 2022-08-09 22:18 (UTC)

I have this error with gcc-12.1.1.

In file included from debug/debug.c:27:
debug/debug.c: In function 'load_file':
debug/debug.c:275:53: error: 'PTR' undeclared (first use in this function)
  275 |     symcount = bfd_read_minisymbols(file->abfd, 0, (PTR)&file->syms, &size);
      |                                                     ^~~
debug/debug.c:275:53: note: each undeclared identifier is reported only once for each function it appears in
make[3]: *** [Makefile:1623: debug/libucs_la-debug.lo] Error 1
make[3]: *** Waiting for unfinished jobs....
make[3]: Leaving directory '/home/jed/.cache/yay/openucx/src/ucx/src/ucs'
make[2]: *** [Makefile:1949: all-recursive] Error 1
make[2]: Leaving directory '/home/jed/.cache/yay/openucx/src/ucx/src/ucs'
make[1]: *** [Makefile:765: all-recursive] Error 1
make[1]: Leaving directory '/home/jed/.cache/yay/openucx/src/ucx'
make: *** [Makefile:631: all] Error 2
==> ERROR: A failure occurred in build().
    Aborting...
 -> error making: openucx

carlosal1015 commented on 2021-06-22 19:34 (UTC)

Thanks @vmaffione, now compiles smoothly. Thank you.

vmaffione commented on 2021-06-02 12:55 (UTC)

Updated to 1.10.1. Is the issue still there?

carlosal1015 commented on 2021-06-02 03:32 (UTC)

Hi, I have this error with gcc-11:

  CC       time/libucs_la-timer_wheel.lo
  CC       time/libucs_la-timerq.lo
  CC       type/libucs_la-class.lo
make[2]: *** [Makefile:1558: sys/libucs_la-sock.lo] Error 1
make[2]: *** Waiting for unfinished jobs....
make[2]: Leaving directory '/tmp/makepkg/openucx/src/ucx/src/ucs'
make[1]: *** [Makefile:733: all-recursive] Error 1
make[1]: Leaving directory '/tmp/makepkg/openucx/src/ucx'
make: *** [Makefile:601: all] Error 2
==> ERROR: A failure occurred in build().
    Aborting...