Package Details: otter-browser-git 0.9.99.1.r1266.g97a464177-1

Git Clone URL: https://aur.archlinux.org/otter-browser-git.git (read-only, click to copy)
Package Base: otter-browser-git
Description: Browser aiming to recreate the best aspects of the classic Opera (12.x) UI using Qt5 - git checkout
Upstream URL: http://otter-browser.org/
Keywords: browser c-plus-plus cross-platform opera otter qt web webkit
Licenses: GPL3
Conflicts: otter-browser
Provides: otter-browser
Submitter: Barthalion
Maintainer: mkljczk
Last Packager: mkljczk
Votes: 31
Popularity: 0.000000
First Submitted: 2014-01-01 20:07 (UTC)
Last Updated: 2020-04-18 17:44 (UTC)

Dependencies (8)

Required by (0)

Sources (1)

Latest Comments

Vitrum-cnkj34kr8 commented on 2022-03-22 02:10 (UTC)

Because of

The unauthenticated git protocol on port 9418 is no longer supported

The source link needs to be changed from "git" to "git+https":

source=('git+https://github.com/OtterBrowser/otter-browser.git')

hk3wx commented on 2020-07-25 02:06 (UTC) (edited on 2020-07-25 02:09 (UTC) by hk3wx)

CMake Error at /usr/lib64/cmake/Qt5/Qt5Config.cmake:28 (find_package): Could not find a package configuration file provided by "Qt5Svg" with any of the following names: Qt5SvgConfig.cmake qt5svg-config.cmake Add the installation prefix of "Qt5Svg" to CMAKE_PREFIX_PATH or set "Qt5Svg_DIR" to a directory containing one of the above files. If "Qt5Svg" provides a separate development package or SDK, be sure it has been installed. Call Stack (most recent call first): CMakeLists.txt:75 (find_package) -- Configuring incomplete, errors occurred!

keren_sky commented on 2018-07-04 23:09 (UTC)

Hai, my sucky ISP switched my landline to a new package. Now svn:// and plain git:// clones don't work anymore. Would you modify the sources to git+https://github.com/OtterBrowser/otter-browser.git Thnx!

dreieck commented on 2018-06-02 18:46 (UTC) (edited on 2018-06-02 18:48 (UTC) by dreieck)

Fails when packaging:

==> ERROR: optdepends contains invalid characters: '>='
==> ERROR: Makepkg was unable to build otter-browser-git.

Xeno_Idaltu commented on 2017-12-20 11:25 (UTC)

Beautiful browser when used with QTCurve.

My only wish is for Otter Browser let us choose icon themes.

I have a dark blue color theme and it's hard to see the icons since they are black.

mkljczk commented on 2017-01-27 15:55 (UTC) (edited on 2017-01-27 16:03 (UTC) by mkljczk)

It's better to use qt5-webkit-ng package, maintained fork of qt5-webkit, maybe there should be info about it?

esclapion commented on 2016-05-28 12:31 (UTC)

Needs gst-libav and gst-good-plugins to watch videos.

boenki commented on 2016-01-01 23:09 (UTC)

now depends on 'sonnet' for spellchecking

eworm commented on 2015-08-13 20:13 (UTC)

@renegat: Builds just fine here with qt5-declarative-5.5.0-1... What's your issue?

commented on 2015-08-13 19:18 (UTC)

Does not build, has to depend on 'qt5-declarative-git' (libqt5quick, QOpenGLFunctions)

pmattern commented on 2015-03-05 14:42 (UTC)

Any attempt to update this package in a way that reuses an existing checkout, e. g. just running 'makepkg -s' in $startdir again or using 'pacaur -S' with clean=false and builddir set in pacaur's config file, fails as command 'mkdir otter-browser/build' fails if directory build exists. Changing 'mkdir' to 'mkdir -p' solves this.

pmattern commented on 2015-02-04 12:06 (UTC)

Upstream started using github.com/OtterBrowser/otter-browser, github.com/Emdek/otter is redirecting for now.

arzeth commented on 2014-12-27 13:43 (UTC)

Now it depends also on qt5-multimedia (build fails without it): https://github.com/Emdek/otter/commit/3d1295dac820662abf9997defe1588d1dc7b02c5

Lenny commented on 2014-11-17 22:59 (UTC)

it's just a package version, package is built from git HEAD

ersi-dnd commented on 2014-11-17 17:09 (UTC)

The non-git release is at 0.9.03 while this is at 0.9.01 :S

MikuroK commented on 2014-07-03 23:24 (UTC)

makedepends=('cmake') makedepends=('git') should be: makedepends=('cmake' 'git') right now the second line overwrites the first and only git is requested for installation.

boenki commented on 2014-06-03 21:00 (UTC)

@haagch: please file bugreports here if you can https://github.com/Emdek/otter/issues

haagch commented on 2014-06-03 19:31 (UTC)

Works, but I get a segfault when going to get.webgl.org Program received signal SIGSEGV, Segmentation fault. 0x0000000000000000 in ?? () (gdb) bt #0 0x0000000000000000 in ?? () #1 0x00007ffff5b1e2f7 in ?? () from /usr/lib/libQt5WebKit.so.5 #2 0x00007ffff5af03d3 in ?? () from /usr/lib/libQt5WebKit.so.5 #3 0x00007ffff5b1d6d6 in ?? () from /usr/lib/libQt5WebKit.so.5 #4 0x00007ffff4f30263 in ?? () from /usr/lib/libQt5WebKit.so.5 #5 0x00007ffff4f3c534 in ?? () from /usr/lib/libQt5WebKit.so.5 #6 0x00007ffff4f3905b in ?? () from /usr/lib/libQt5WebKit.so.5 #7 0x00007ffff5158290 in ?? () from /usr/lib/libQt5WebKit.so.5 #8 0x00007fff9280f0e5 in ?? () #9 0xffff000000000002 in ?? () #10 0x00007ffff5d82c76 in ?? () from /usr/lib/libQt5WebKit.so.5 #11 0x0000000000000000 in ?? () qt5-webkit 5.3.0-3 Is this a problem of archlinux's qt webkit or general?

someoneelse123 commented on 2014-01-05 12:41 (UTC)

Ok, to summarize. Error from my first post appears on fully upgraded system, with everything qt5-related on 5.2.0-3. To resolve problem, I had to uninstall qt4, what, of course, broke half of my system. I could install qt4 and use all qt4 apps and otter, but only after otter was built and installed. There has to be some sort of build conflict between qt4, qt5 and otter alone.

eworm commented on 2014-01-04 19:03 (UTC)

Works without an issue here... Just built the latest revision to verify. Is your system up to date? This requires Qt >= 5.2.

someoneelse123 commented on 2014-01-04 17:57 (UTC)

Cannot build... In file included from /tmp/yaourt-tmp-tom/aur-otter-browser-git/src/otter/src/ui/AuthenticationDialog.cpp:22:0: /tmp/yaourt-tmp-tom/aur-otter-browser-git/src/otter/build/ui_AuthenticationDialog.h:13:25: fatal error: QtGui/QAction: No such file or directory #include <QtGui/QAction> ^ compilation terminated. CMakeFiles/otter-browser.dir/build.make:737: recipe for target 'CMakeFiles/otter-browser.dir/src/ui/AuthenticationDialog.cpp.o' failed make[2]: *** [CMakeFiles/otter-browser.dir/src/ui/AuthenticationDialog.cpp.o] Error 1 CMakeFiles/Makefile2:63: recipe for target 'CMakeFiles/otter-browser.dir/all' failed make[1]: *** [CMakeFiles/otter-browser.dir/all] Error 2 Makefile:136: recipe for target 'all' failed make: *** [all] Error 2