Package Details: otter-browser-git 0.9.99.r149.g6d9a7f72b-1

Git Clone URL: https://aur.archlinux.org/otter-browser-git.git (read-only)
Package Base: otter-browser-git
Description: Browser aiming to recreate the best aspects of the classic Opera (12.x) UI using Qt5 - git checkout
Upstream URL: http://otter-browser.org/
Keywords: browser c-plus-plus cross-platform opera otter qt web webkit
Licenses: GPL3
Conflicts: otter-browser
Provides: otter-browser
Submitter: Barthalion
Maintainer: m4sk1n
Last Packager: m4sk1n
Votes: 29
Popularity: 0.001071
First Submitted: 2014-01-01 20:07
Last Updated: 2018-07-01 11:21

Dependencies (8)

Required by (0)

Sources (1)

Latest Comments

« First ‹ Previous 1 2 3

eworm commented on 2014-01-04 19:03

Works without an issue here... Just built the latest revision to verify.
Is your system up to date? This requires Qt >= 5.2.

someoneelse123 commented on 2014-01-04 17:57

Cannot build...

In file included from /tmp/yaourt-tmp-tom/aur-otter-browser-git/src/otter/src/ui/AuthenticationDialog.cpp:22:0:
/tmp/yaourt-tmp-tom/aur-otter-browser-git/src/otter/build/ui_AuthenticationDialog.h:13:25: fatal error: QtGui/QAction: No such file or directory
#include <QtGui/QAction>
^
compilation terminated.
CMakeFiles/otter-browser.dir/build.make:737: recipe for target 'CMakeFiles/otter-browser.dir/src/ui/AuthenticationDialog.cpp.o' failed
make[2]: *** [CMakeFiles/otter-browser.dir/src/ui/AuthenticationDialog.cpp.o] Error 1
CMakeFiles/Makefile2:63: recipe for target 'CMakeFiles/otter-browser.dir/all' failed
make[1]: *** [CMakeFiles/otter-browser.dir/all] Error 2
Makefile:136: recipe for target 'all' failed
make: *** [all] Error 2