Package Details: palemoon-gtk3 1:33.1.1-2

Git Clone URL: https://aur.archlinux.org/palemoon-gtk3.git (read-only, click to copy)
Package Base: palemoon-gtk3
Description: Open source web browser based on Firefox focusing on efficiency.
Upstream URL: https://www.palemoon.org/
Licenses: GPL, MPL, LGPL
Conflicts: palemoon
Provides: palemoon
Submitter: micwoj92
Maintainer: micwoj92
Last Packager: micwoj92
Votes: 4
Popularity: 0.000299
First Submitted: 2021-06-18 15:12 (UTC)
Last Updated: 2024-06-11 20:12 (UTC)

Pinned Comments

micwoj92 commented on 2021-06-18 15:13 (UTC)

Please do not delete this package, it is different than https://aur.archlinux.org/packages/palemoon.

Latest Comments

micwoj92 commented on 2023-08-14 15:15 (UTC)

patch'd

gnaggnoyil commented on 2023-08-14 12:43 (UTC)

Building this package in a clean chroot results in the following error:

7:22.33     INPUT("x86/vp9mc.o")
 7:22.33     INPUT("x86/vp9mc_16bpp.o")
 7:22.33 
 7:22.33 /usr/src/debug/palemoon-gtk3/Pale-Moon/platform/media/ffvpx/libavcodec/x86/mathops.h: Assembler messages:
 7:22.33 /usr/src/debug/palemoon-gtk3/Pale-Moon/platform/media/ffvpx/libavcodec/x86/mathops.h:125: Error: operand type mismatch for `shr'
 7:22.33 /usr/src/debug/palemoon-gtk3/Pale-Moon/platform/media/ffvpx/libavcodec/x86/mathops.h: Assembler messages:
 7:22.33 /usr/src/debug/palemoon-gtk3/Pale-Moon/platform/media/ffvpx/libavcodec/x86/mathops.h:125: Error: operand type mismatch for `shr'
 7:22.33 /usr/src/debug/palemoon-gtk3/Pale-Moon/platform/media/ffvpx/libavcodec/x86/mathops.h:125: Error: operand type mismatch for `shr'
 7:22.33 /usr/src/debug/palemoon-gtk3/Pale-Moon/platform/media/ffvpx/libavcodec/x86/mathops.h:125: Error: operand type mismatch for `shr'
 7:22.33 /usr/src/debug/palemoon-gtk3/Pale-Moon/platform/media/ffvpx/libavcodec/x86/mathops.h:125: Error: operand type mismatch for `shr'
 7:22.33 make[6]: *** [/tmp/ccw7xSsT.mk:8: /tmp/ccoWwL7j.ltrans2.ltrans.o] Error 1
 7:22.33 make[6]: *** Waiting for unfinished jobs....
 7:22.34 /usr/src/debug/palemoon-gtk3/Pale-Moon/platform/media/ffvpx/libavcodec/x86/mathops.h:125: Error: operand type mismatch for `shr'
 7:22.34 /usr/src/debug/palemoon-gtk3/Pale-Moon/platform/media/ffvpx/libavcodec/x86/mathops.h:125: Error: operand type mismatch for `shr'
 7:22.34 /usr/src/debug/palemoon-gtk3/Pale-Moon/platform/media/ffvpx/libavcodec/x86/mathops.h:125: Error: operand type mismatch for `shr'
 7:22.34 /usr/src/debug/palemoon-gtk3/Pale-Moon/platform/media/ffvpx/libavcodec/x86/mathops.h:125: Error: operand type mismatch for `shr'
 7:22.34 /usr/src/debug/palemoon-gtk3/Pale-Moon/platform/media/ffvpx/libavcodec/x86/mathops.h:125: Error: operand type mismatch for `shr'
 7:22.34 /usr/src/debug/palemoon-gtk3/Pale-Moon/platform/media/ffvpx/libavcodec/x86/mathops.h:125: Error: operand type mismatch for `shr'
 7:22.34 /usr/src/debug/palemoon-gtk3/Pale-Moon/platform/media/ffvpx/libavcodec/x86/mathops.h:125: Error: operand type mismatch for `shr'
 7:22.34 /usr/src/debug/palemoon-gtk3/Pale-Moon/platform/media/ffvpx/libavcodec/x86/mathops.h:125: Error: operand type mismatch for `shr'
 7:22.35 /usr/src/debug/palemoon-gtk3/Pale-Moon/platform/media/ffvpx/libavcodec/x86/mathops.h:125: Error: operand type mismatch for `shr'
 7:22.35 /usr/src/debug/palemoon-gtk3/Pale-Moon/platform/media/ffvpx/libavcodec/x86/mathops.h:125: Error: operand type mismatch for `shr'
 7:22.35 /usr/src/debug/palemoon-gtk3/Pale-Moon/platform/media/ffvpx/libavcodec/x86/mathops.h:125: Error: operand type mismatch for `shr'
 7:22.35 /usr/src/debug/palemoon-gtk3/Pale-Moon/platform/media/ffvpx/libavcodec/x86/mathops.h:125: Error: operand type mismatch for `shr'
 7:22.35 /usr/src/debug/palemoon-gtk3/Pale-Moon/platform/media/ffvpx/libavcodec/x86/mathops.h:125: Error: operand type mismatch for `shr'
 7:22.35 /usr/src/debug/palemoon-gtk3/Pale-Moon/platform/media/ffvpx/libavcodec/x86/mathops.h:125: Error: operand type mismatch for `shr'
 7:22.35 /usr/src/debug/palemoon-gtk3/Pale-Moon/platform/media/ffvpx/libavcodec/x86/mathops.h:125: Error: operand type mismatch for `shr'
 7:22.35 /usr/src/debug/palemoon-gtk3/Pale-Moon/platform/media/ffvpx/libavcodec/x86/mathops.h:125: Error: operand type mismatch for `shr'
 7:22.35 /usr/src/debug/palemoon-gtk3/Pale-Moon/platform/media/ffvpx/libavcodec/x86/mathops.h:125: Error: operand type mismatch for `shr'
 7:22.35 /usr/src/debug/palemoon-gtk3/Pale-Moon/platform/media/ffvpx/libavcodec/x86/mathops.h:125: Error: operand type mismatch for `shr'
 7:22.35 /usr/src/debug/palemoon-gtk3/Pale-Moon/platform/media/ffvpx/libavcodec/x86/mathops.h:125: Error: operand type mismatch for `shr'
 7:22.35 /usr/src/debug/palemoon-gtk3/Pale-Moon/platform/media/ffvpx/libavcodec/x86/mathops.h:125: Error: operand type mismatch for `shr'
 7:22.35 /usr/src/debug/palemoon-gtk3/Pale-Moon/platform/media/ffvpx/libavcodec/x86/mathops.h:125: Error: operand type mismatch for `shr'
 7:22.35 /usr/src/debug/palemoon-gtk3/Pale-Moon/platform/media/ffvpx/libavcodec/x86/mathops.h:125: Error: operand type mismatch for `shr'
 7:22.35 /usr/src/debug/palemoon-gtk3/Pale-Moon/platform/media/ffvpx/libavcodec/x86/mathops.h:125: Error: operand type mismatch for `shr'
 7:22.35 /usr/src/debug/palemoon-gtk3/Pale-Moon/platform/media/ffvpx/libavcodec/x86/mathops.h:125: Error: operand type mismatch for `shr'
 7:22.35 /usr/src/debug/palemoon-gtk3/Pale-Moon/platform/media/ffvpx/libavcodec/x86/mathops.h:125: Error: operand type mismatch for `shr'
 7:22.35 /usr/src/debug/palemoon-gtk3/Pale-Moon/platform/media/ffvpx/libavcodec/x86/mathops.h:125: Error: operand type mismatch for `shr'
 7:22.35 /usr/src/debug/palemoon-gtk3/Pale-Moon/platform/media/ffvpx/libavcodec/x86/mathops.h:125: Error: operand type mismatch for `shr'
 7:22.35 /usr/src/debug/palemoon-gtk3/Pale-Moon/platform/media/ffvpx/libavcodec/x86/mathops.h:125: Error: operand type mismatch for `shr'
 7:22.35 /usr/src/debug/palemoon-gtk3/Pale-Moon/platform/media/ffvpx/libavcodec/x86/mathops.h:125: Error: operand type mismatch for `shr'
 7:22.35 /usr/src/debug/palemoon-gtk3/Pale-Moon/platform/media/ffvpx/libavcodec/x86/mathops.h:125: Error: operand type mismatch for `shr'
 7:22.35 /usr/src/debug/palemoon-gtk3/Pale-Moon/platform/media/ffvpx/libavcodec/x86/mathops.h:125: Error: operand type mismatch for `shr'
 7:22.35 make[6]: *** [/tmp/ccw7xSsT.mk:14: /tmp/ccoWwL7j.ltrans4.ltrans.o] Error 1
 7:22.35 lto-wrapper: fatal error: make returned 2 exit status
 7:22.35 compilation terminated.
 7:22.35 ../../../build/unix/gold/ld: fatal error: lto-wrapper failed
 7:22.35 collect2: error: ld returned 1 exit status
 7:22.35 make[5]: *** [/build/palemoon-gtk3/src/Pale-Moon/platform/config/rules.mk:772: libmozavcodec.so] Error 1
 7:22.35 make[4]: *** [/build/palemoon-gtk3/src/Pale-Moon/platform/config/recurse.mk:71: media/ffvpx/libavcodec/target] Error 2
 7:22.35 make[4]: *** Waiting for unfinished jobs....
 7:55.58 libjs_static.a
 7:56.48 make[3]: *** [/build/palemoon-gtk3/src/Pale-Moon/platform/config/recurse.mk:33: compile] Error 2
 7:56.48 make[2]: *** [/build/palemoon-gtk3/src/Pale-Moon/platform/config/rules.mk:493: default] Error 2
 7:56.48 make[1]: *** [/build/palemoon-gtk3/src/Pale-Moon/client.mk:406: realbuild] Error 2
 7:56.48 make: *** [client.mk:164: build] Error 2
 7:56.51 0 compiler warnings present.
 7:56.52 Notification center failed: Install the python dbus module to get a notification when the build finishes.
==> ERROR: A failure occurred in build().
    Aborting...
==> ERROR: Build failed, check /var/lib/archbuild/extra-x86_64/gnaggnoyil/build

Anyone have idea what's going wrong here?

micwoj92 commented on 2022-11-02 14:16 (UTC)

What's wrong with sha1? I have no reason to change it.

RubenKelevra commented on 2022-11-02 14:15 (UTC)

Please use something stronger than SHA1, like Blake2b. Thank you.

micwoj92 commented on 2022-06-10 05:25 (UTC)

@guglovich please don't lie, this does not even use curl. And use out of date template.

guglovich commented on 2022-06-09 22:19 (UTC)

curl: (22) The requested URL returned error: 404

micwoj92 commented on 2022-03-30 16:18 (UTC)

Yes, the latest version is now 29.4.5.1, I don't have much time now, please mark this package out of date and I will update during weekend.

gnaggnoyil commented on 2022-03-30 16:00 (UTC)

I tried building this package today and it gave the following error:

==> Starting prepare()...
Submodule 'platform' (https://repo.palemoon.org/MoonchildProductions/GRE.git) registered for path 'platform'
Cloning into '/home/gnaggnoyil/.cache/yay/palemoon-gtk3/src/Pale-Moon/platform'...
done.
fatal: git upload-pack: not our ref 78781a3cb14810623730922b1d6f3623d443ef14
fatal: remote error: upload-pack: not our ref 78781a3cb14810623730922b1d6f3623d443ef14
fatal: Fetched in submodule path 'platform', but it did not contain 78781a3cb14810623730922b1d6f3623d443ef14. Direct fetching of that commit failed.
fatal: 
==> ERROR: A failure occurred in prepare().
    Aborting...
 -> error making: palemoon-gtk3

This error didn't happen when building this package in the day of the latest update. Is upstream having some changes there?

micwoj92 commented on 2021-06-18 15:13 (UTC)

Please do not delete this package, it is different than https://aur.archlinux.org/packages/palemoon.