Package Details: pam-face-authentication 0.3-9

Git Clone URL: https://aur.archlinux.org/pam-face-authentication.git (read-only)
Package Base: pam-face-authentication
Description: PAM face auth
Upstream URL: http://code.google.com/p/pam-face-authentication
Licenses: GPL
Submitter: None
Maintainer: funilrys
Last Packager: funilrys
Votes: 31
Popularity: 0.000860
First Submitted: 2009-10-10 08:48
Last Updated: 2017-08-26 14:41

Latest Comments

« First ‹ Previous 1 2 3 4 Next › Last »

Anonymous comment on 2011-09-14 21:03

Moved to pam-face-authenticaion-svn (ID=52385) since it's really taken from a subversion repo. I'll update next PKGBUILDs from there.
I orphan this package.

Anonymous comment on 2011-09-14 20:42

@akshay2000:
I've fixed the 404 error.

In order to keep this clean, please remove comments about solved errors or bugs.

Anonymous comment on 2011-09-14 20:42

@akshay2000:
I've fixed the 404 error. In order to keep this clean, please remove comments about solved errors or bugs.

Anonymous comment on 2011-08-28 06:16

I'm getting an error saying:

Resolving www.google.com... 74.125.236.50, 74.125.236.49, 74.125.236.48, ...
Connecting to www.google.com|74.125.236.50|:443... connected.
HTTP request sent, awaiting response... 404 Not Found
2011-08-28 11:44:32 ERROR 404: Not Found.

==> ERROR: Failure while downloading svn.diff
Aborting...

So, I can't create the package by makepkg. Any help?

Anonymous comment on 2011-08-10 12:17

The checksum of OpenCVConfig.cmake is wrong. Should be 11409234bbc140d6068c3ea06eb52430

Thanks for the PKGBUILD! :-)

Anonymous comment on 2011-08-10 12:04

New release. Solved issue 75 (see google code).

The issue submited by kurisutian was due to a debugging error and i've solved it.

Anonymous comment on 2011-08-10 10:35

It seems like there's still a Bug in there:

collect2: ld returned 1 exit status
make[2]: *** [qt-facetrainer] Error 1
make[1]: *** [CMakeFiles/qt-facetrainer.dir/all] Error 2
make: *** [all] Error 2
==> ERROR: A failure occurred in package().
Aborting...
==> ERROR: Makepkg was unable to build pam-face-authentication.

Anonymous comment on 2011-07-11 17:41

WARNING: I'm working on a final release (0.3-4). Don't install it until I solve the OpenCV bugs.

Anonymous comment on 2011-07-07 15:58

Now (0.3-2) using opencv-old from the AUR instead of opencv from [extra].

schneida commented on 2011-03-11 12:06

Can confirm that it doesn't work with the current opencv from extra.