Package Details: pamac-aur 10.1.3-1

Git Clone URL: https://aur.archlinux.org/pamac-aur.git (read-only, click to copy)
Package Base: pamac-aur
Description: A Gtk3 frontend, Package Manager based on libalpm with AUR and Appstream support
Upstream URL: https://gitlab.manjaro.org/applications
Keywords: gui installer libalpm package pacman yay
Licenses: GPL3
Conflicts: pamac, pamac-tray-appindicator
Provides: pamac=10.1.3-1
Submitter: Zeph
Maintainer: Zeph
Last Packager: Zeph
Votes: 344
Popularity: 7.32
First Submitted: 2013-12-05 12:57
Last Updated: 2021-06-10 22:10

Dependencies (27)

Required by (5)

Sources (1)

Latest Comments

« First ‹ Previous ... 4 5 6 7 8 9 10 11 12 13 14 ... Next › Last »

papa33 commented on 2020-03-17 23:47

There is a bug in archlinux-appstream-data-20200315-1 that causes pamac to display empty results when browsing categories. The offending file is /usr/share/app-info/xmls/community.xml.gz.

Zeph commented on 2020-03-10 17:22

v9.3.93 build with vala 0.48 OK (9.4.0 release candidate 3)

Thorned_Rose commented on 2020-03-10 08:43

@jaturon2526, as below, it's a known issue currently with Vala 0.47 and above. See https://gitlab.manjaro.org/applications/pamac/issues/735#note_15381

You can downgrade to Vala < 0.47, build Pamac and then update Vala to get around it for now.

jaturon2526 commented on 2020-03-10 08:08

Error after build.

src/25a6634@@pamac-daemon@exe/alpm_utils.c: In function ‘pamac_alpm_utils_update_dbs’: src/25a6634@@pamac-daemon@exe/alpm_utils.c:1960:4: error: function ‘__errno_location’ is initialized like a variable 1960 | alpm_errno_t errno = 0; | ^~~~~~~~~~~~ src/25a6634@@pamac-daemon@exe/alpm_utils.c: In function ‘pamac_alpm_utils_trans_init’: src/25a6634@@pamac-daemon@exe/alpm_utils.c:2552:3: error: function ‘__errno_location’ is initialized like a variable 2552 | alpm_errno_t errno = 0; | ^~~~~~~~~~~~ src/25a6634@@pamac-daemon@exe/alpm_utils.c: In function ‘pamac_alpm_utils_trans_sysupgrade’: src/25a6634@@pamac-daemon@exe/alpm_utils.c:2611:3: error: function ‘__errno_location’ is initialized like a variable 2611 | alpm_errno_t errno = 0; | ^~~~~~~~~~~~ src/25a6634@@pamac-daemon@exe/alpm_utils.c: In function ‘pamac_alpm_utils_trans_add_pkg_real’: src/25a6634@@pamac-daemon@exe/alpm_utils.c:2720:3: error: function ‘__errno_location’ is initialized like a variable 2720 | alpm_errno_t errno = 0; | ^~~~~~~~~~~~ src/25a6634@@pamac-daemon@exe/alpm_utils.c: In function ‘pamac_alpm_utils_trans_load_pkg’: src/25a6634@@pamac-daemon@exe/alpm_utils.c:3318:3: error: function ‘__errno_location’ is initialized like a variable 3318 | alpm_errno_t errno = 0; | ^~~~~~~~~~~~ src/25a6634@@pamac-daemon@exe/alpm_utils.c:3359:4: error: function ‘__errno_location’ is initialized like a variable 3359 | alpm_errno_t errno = 0; | ^~~~~~~~~~~~ src/25a6634@@pamac-daemon@exe/alpm_utils.c: In function ‘pamac_alpm_utils_trans_remove_pkg’: src/25a6634@@pamac-daemon@exe/alpm_utils.c:3474:4: error: function ‘__errno_location’ is initialized like a variable 3474 | alpm_errno_t errno = 0; | ^~~~~~~~~~~~ src/25a6634@@pamac-daemon@exe/alpm_utils.c: In function ‘pamac_alpm_utils_trans_prepare_real’: src/25a6634@@pamac-daemon@exe/alpm_utils.c:3787:3: error: function ‘__errno_location’ is initialized like a variable 3787 | alpm_errno_t errno = 0; | ^~~~~~~~~~~~ src/25a6634@@pamac-daemon@exe/alpm_utils.c: In function ‘pamac_alpm_utils_build_prepare’: src/25a6634@@pamac-daemon@exe/alpm_utils.c:5065:4: error: function ‘__errno_location’ is initialized like a variable 5065 | alpm_errno_t errno = 0; | ^~~~~~~~~~~~ src/25a6634@@pamac-daemon@exe/alpm_utils.c: In function ‘pamac_alpm_utils_trans_commit_real’: src/25a6634@@pamac-daemon@exe/alpm_utils.c:6659:3: error: function ‘__errno_location’ is initialized like a variable 6659 | alpm_errno_t errno = 0; | ^~~~~~~~~~~~

Thorned_Rose commented on 2020-03-08 08:15

@kinoe It's a known issue currently with Vala 0.47 and above. See https://gitlab.manjaro.org/applications/pamac/issues/735#note_15381

You can downgrade to Vala < 0.47, build Pamac and then update Vala to get around it for now.

kinoe commented on 2020-03-08 05:25

Build failed: ninja: build stopped: subcommand failed. [15/71] Compiling C object 'src/25a6634@@pamac-daemon@exe/meson-generated_alpm_utils.c.o'. FAILED: src/25a6634@@pamac-daemon@exe/meson-generated_alpm_utils.c.o

freefreeno commented on 2020-02-11 22:47

Can someone tell me why I keep getting pacman and pacmac out of sync? Pamac is showing updates and pacman isn't. Do they not use the same mirrors ?? Does pacmac use http mirrors also because this is all I have marked.

friday commented on 2020-01-16 22:36

@agentcobra We clearly have seen it. Following those instructions didn't fix this build. They changed it so that libx11 now depends on xorgproto again though, so it's not likely anyone will get that build error any more.

agentcobra commented on 2020-01-16 22:23

@webreflection see https://www.archlinux.org/news/xorg-cleanup-requires-manual-intervention/

webreflection commented on 2020-01-07 11:23

fwiw, I agree with what friday said, as this doesn't build anymore as is due xorgproto missing