Package Details: panomatic 0.9.4-5

Git Clone URL: https://aur.archlinux.org/panomatic.git (read-only)
Package Base: panomatic
Description: Automatic control point creator for Hugin
Upstream URL: http://aorlinsk2.free.fr/panomatic/
Licenses: GPL-2
Submitter: jose1711
Maintainer: None
Last Packager: jose1711
Votes: 13
Popularity: 0.000000
First Submitted: 2008-08-19 21:43
Last Updated: 2015-06-12 19:51

Latest Comments

jose1711 commented on 2017-03-05 18:22

tried to patch using some patches from freebsd ports, also used gcc 4.4 but to no avail. as i am unable to fix this, disowning. this is a software that did not see a new release in 9 years, i think there are better alternatives.

nipsky commented on 2017-03-01 12:22

Compilation fails for me with:
g++ -DPACKAGE_NAME=\"panomatic\" -DPACKAGE_TARNAME=\"panomatic\" -DPACKAGE_VERSION=\"1.0\" -DPACKAGE_STRING=\"panomatic\ 1.0\" -DPACKAGE_BUGREPORT=\"naouel@naouel.org\" -DPACKAGE=\"panomatic\" -DVERSION=\"1.0\" -DSTDC_HEADERS=1 -DHAVE_SYS_TYPES_H=1 -DHAVE_SYS_STAT_H=1 -DHAVE_STDLIB_H=1 -DHAVE_STRING_H=1 -DHAVE_MEMORY_H=1 -DHAVE_STRINGS_H=1 -DHAVE_INTTYPES_H=1 -DHAVE_STDINT_H=1 -DHAVE_UNISTD_H=1 -DHAVE_DIRENT_H=1 -DSTDC_HEADERS=1 -DHAVE_LIMITS_H=1 -DHAVE_STDLIB_H=1 -DHAVE_STRING_H=1 -DHAVE_UNISTD_H=1 -DHAVE_POSIX_THREADS= -DHAVE_SCHED_RT= -DHAVE_SCHED_YIELD= -DHAVE_PTHREAD_YIELD= -DHAVE_PTHREADKEY_CREATE= -DHAVE_BOOST= -DPNG_NO_ASSEMBLER_CODE= -I. -I../include -D_FORTIFY_SOURCE=2 -DNDEBUG -march=x86-64 -mtune=generic -O2 -pipe -fstack-protector-strong -MT ConcurrentExecutor.o -MD -MP -MF .deps/ConcurrentExecutor.Tpo -c -o ConcurrentExecutor.o ConcurrentExecutor.cxx
In file included from vanilla/SimpleAtomicCount.cxx:26:0,
from AtomicCount.cxx:55:
../include/zthread/Guard.h: In static member function ‘static void ZThread::CompoundScope<Scope1, Scope2>::createScope(ZThread::LockHolder<LockType>&, long unsigned int)’:
../include/zthread/Guard.h:117:16: error: return-statement with a value, in function returning 'void' [-fpermissive]
return false;
^~~~~
../include/zthread/Guard.h:121:12: error: return-statement with a value, in function returning 'void' [-fpermissive]
return true;
^~~~
In file included from ConditionImpl.h:26:0,
from Condition.cxx:24:
../include/zthread/Guard.h: In static member function ‘static void ZThread::CompoundScope<Scope1, Scope2>::createScope(ZThread::LockHolder<LockType>&, long unsigned int)’:
../include/zthread/Guard.h:117:16: error: return-statement with a value, in function returning 'void' [-fpermissive]
return false;
^~~~~
../include/zthread/Guard.h:121:12: error: return-statement with a value, in function returning 'void' [-fpermissive]
return true;
^~~~
make[2]: *** [Makefile:303: AtomicCount.o] Error 1
make[2]: *** Waiting for unfinished jobs....
In file included from ../include/zthread/ConcurrentExecutor.h:26:0,
from ConcurrentExecutor.cxx:23:
../include/zthread/PoolExecutor.h:58:9: warning: ‘ZThread::PoolExecutor’ has a field ‘ZThread::PoolExecutor::_impl’ whose type uses the anonymous namespace [-Wsubobject-linkage]
class PoolExecutor : public Executor {
^~~~~~~~~~~~
mv -f .deps/ConcurrentExecutor.Tpo .deps/ConcurrentExecutor.Po
../include/zthread/Guard.h: In instantiation of ‘ZThread::Guard<LockType, LockingPolicy>::Guard(ZThread::Guard<U, V>&) [with U = ZThread::FastLock; V = ZThread::LockedScope; LockType = ZThread::FastLock; LockingPolicy = ZThread::UnlockedScope]’:
ConditionImpl.h:235:45: required from ‘void ZThread::ConditionImpl<List>::wait() [with List = ZThread::fifo_list]’
Condition.cxx:52:17: required from here
../include/zthread/Guard.h:431:45: error: ‘extract’ was not declared in this scope, and no declarations were found by argument-dependent lookup at the point of instantiation [-fpermissive]
LockingPolicy::shareScope(*this, extract(g));
~~~~~~~^~~
../include/zthread/Guard.h:431:45: note: declarations in dependent base ‘ZThread::LockHolder<ZThread::FastLock>’ are not found by unqualified lookup
../include/zthread/Guard.h:431:45: note: use ‘this->extract’ instead
make[2]: *** [Makefile:303: Condition.o] Error 1
make[2]: Leaving directory '/tmp/yaourt-tmp-andre/aur-panomatic/src/panomatic-0.9.4/zthread/src'
make[1]: *** [Makefile:323: all-recursive] Error 1
make[1]: Leaving directory '/tmp/yaourt-tmp-andre/aur-panomatic/src/panomatic-0.9.4/zthread/src'
make: *** [Makefile:226: all-recursive] Error 1

dracorp commented on 2013-06-11 09:32

Added automake 1.10 to makedepends but I still get the error as in psycho_zs.

jose1711 commented on 2013-01-04 14:09

probably gcc incompatibility. i'm sorry but until someone provides a patch i am unable to fix this.

Anonymous comment on 2012-12-24 10:11

It does not build on current Arch:

../include/zthread/Guard.h:431:5: error: «extract» was not declared in this scope, and no declarations were found by argument-dependent lookup at the point of instantiation [-fpermissive]
../include/zthread/Guard.h:431:5: warning: declarations in dependent base «ZThread::LockHolder<ZThread::FastLock>» are not found by unqualified lookup
../include/zthread/Guard.h:431:5: warning: use «this->extract» instead

jose1711 commented on 2010-06-03 15:00

@emericn6k: thank you, updated

emericn6k commented on 2010-06-01 17:46

This PKGBUILD works also for x86_64. Architecture could be modified in order to allow this.