Package Details: pantheon-calendar-git 5.1.1.r100.gda1ac55d-1

Git Clone URL: https://aur.archlinux.org/pantheon-calendar-git.git (read-only, click to copy)
Package Base: pantheon-calendar-git
Description: The Pantheon Calendar
Upstream URL: https://github.com/elementary/calendar
Licenses: GPL3
Conflicts: pantheon-calendar
Provides: pantheon-calendar
Submitter: alucryd
Maintainer: SolarAquarion
Last Packager: SolarAquarion
Votes: 22
Popularity: 0.000001
First Submitted: 2017-05-01 15:09 (UTC)
Last Updated: 2021-02-21 04:29 (UTC)

Latest Comments

alucryd commented on 2018-10-19 09:21 (UTC)

Bumped to the latest version, this one builds fine.

pablo1 commented on 2018-10-18 08:06 (UTC) (edited on 2018-10-18 08:06 (UTC) by pablo1)

The build fails, see error message:

==> Making package: pantheon-calendar 0.4.1-1 (Thu 18 Oct 2018 09:47:21 AM CEST)
==> Checking runtime dependencies...
==> Checking buildtime dependencies...
==> Retrieving sources...
  -> Downloading pantheon-calendar-0.4.1.tar.gz...
  % Total    % Received % Xferd  Average Speed   Time    Time     Time  Current
                                 Dload  Upload   Total   Spent    Left  Speed
100   126    0   126    0     0    226      0 --:--:-- --:--:-- --:--:--   226
100  461k    0  461k    0     0   287k      0 --:--:--  0:00:01 --:--:-- 1003k
==> Validating source files with sha256sums...
    pantheon-calendar-0.4.1.tar.gz ... Passed
==> Extracting sources...
  -> Extracting pantheon-calendar-0.4.1.tar.gz with bsdtar
==> Starting prepare()...
==> Starting build()...
-- The C compiler identification is GNU 8.2.1
-- Check for working C compiler: /usr/bin/cc
-- Check for working C compiler: /usr/bin/cc -- works
-- Detecting C compiler ABI info
-- Detecting C compiler ABI info - done
-- Detecting C compile features
-- Detecting C compile features - done
-- Found PkgConfig: /usr/bin/pkg-config (found version "1.5.3") 
-- Checking for modules 'gobject-2.0;gthread-2.0;glib-2.0;gio-2.0;gee-0.8;gtk+-3.0>=3.11.6;granite>=0.5;libedataserver-1.2;libecal-1.2>=3.8.0;libedataserverui-1.2;libical;gmodule-2.0'
--   Found gobject-2.0, version 2.58.1
--   Found gthread-2.0, version 2.58.1
--   Found glib-2.0, version 2.58.1
--   Found gio-2.0, version 2.58.1
--   Found gee-0.8, version 0.20.1
--   Found gtk+-3.0, version 3.24.1
--   Found granite, version 5.1.0
--   Found libedataserver-1.2, version 3.30.1
--   Found libecal-1.2, version 3.30.1
--   Found libedataserverui-1.2, version 3.30.1
--   Found libical, version 3.0.4
--   Found gmodule-2.0, version 2.58.1
-- Checking for modules 'champlain-gtk-0.12;champlain-0.12;clutter-1.0;geocode-glib-1.0;clutter-gtk-1.0;folks'
--   Found champlain-gtk-0.12, version 0.12.16
--   Found champlain-0.12, version 0.12.16
--   Found clutter-1.0, version 1.26.2
--   Found geocode-glib-1.0, version 3.26.0
--   Found clutter-gtk-1.0, version 1.8.4
--   Found folks, version 0.11.5.20180908
-- Found Vala: /usr/bin/valac  
-- checking for Vala version of 0.23.2
--   found Vala, version 0.42.2
-- libnotify enabled
-- Plugins enabled
-- GSettings schemas will be installed locally.
-- GSettings schemas will be installed into /usr/share/glib-2.0/schemas/
-- Configuring done
-- Generating done
-- Build files have been written to: /tmp/yaourt-tmp-binaryplease/aur-pantheon-calendar/src/build
Scanning dependencies of target i18n
[  0%] Built target i18n
[  1%] Generating /tmp/yaourt-tmp-binaryplease/aur-pantheon-calendar/src/build/core/config.c;Backends/Backend.c;Backends/BackendsManager.c;Backends/LocalBackend.c;Backends/PlacementWidget.c;Model/CalendarModel.c;Settings/MayaSettings.c;Settings/SavedState.c;Settings/LanguagesFormat.c;DateRange.c;Utils.c;GesturesUtils.c;maya-calendar.vapi;maya-calendar.h
/tmp/yaourt-tmp-binaryplease/aur-pantheon-calendar/src/calendar-0.4.1/vapi/posix-extension.vapi:4.2-4.19: error: `Posix' already contains a definition for `NLTime'
    public enum NLTime {
    ^^^^^^^^^^^^^^^^^^
posix.vapi:3356.2-3356.19: note: previous definition of `NLTime' was here
    public enum NLTime {
    ^^^^^^^^^^^^^^^^^^
Compilation failed: 1 error(s), 0 warning(s)
make[2]: *** [core/CMakeFiles/libmaya-calendar.dir/build.make:116: core/libmaya-calendar_valac.stamp] Error 1
make[1]: *** [CMakeFiles/Makefile2:292: core/CMakeFiles/libmaya-calendar.dir/all] Error 2
make: *** [Makefile:130: all] Error 2
==> ERROR: A failure occurred in build().
    Aborting...
==> ERROR: Makepkg was unable to build pantheon-calendar.
==> Restart building pantheon-calendar ? [y/N]
==> ------------------------------------------
==> 

Smile4ever commented on 2018-08-01 19:21 (UTC)

[ 1%] Generating /tmp/yaourt-tmp-geoffrey/aur-pantheon-calendar/src/build/core/config.c;Backends/Backend.c;Backends/BackendsManager.c;Backends/LocalBackend.c;Backends/PlacementWidget.c;Model/CalendarModel.c;Settings/MayaSettings.c;Settings/SavedState.c;Settings/LanguagesFormat.c;DateRange.c;Utils.c;GesturesUtils.c;maya-calendar.vapi;maya-calendar.h /tmp/yaourt-tmp-geoffrey/aur-pantheon-calendar/src/calendar-0.4.1/vapi/posix-extension.vapi:4.2-4.19: error: Posix' already contains a definition forNLTime' public enum NLTime { ^^^^^^^^^^^^^^^^^^ posix.vapi:3081.2-3081.19: note: previous definition of `NLTime' was here public enum NLTime { ^^^^^^^^^^^^^^^^^^ Compilation failed: 1 error(s), 0 warning(s) make[2]: [core/CMakeFiles/libmaya-calendar.dir/build.make:116: core/libmaya-calendar_valac.stamp] Fout 1 make[1]: [CMakeFiles/Makefile2:287: core/CMakeFiles/libmaya-calendar.dir/all] Fout 2 make: *** [Makefile:130: all] Fout 2

btd1337 commented on 2018-07-21 00:43 (UTC)

==> Starting prepare()...

sed: no input files

==> ERROR: A failure occurred in prepare().

Aborting...

2018-07-20 21:39:54,652 - wrappers - makepkg - ERROR - makepkg query ['makepkg', '-cf', '--noconfirm'] failed in directory /home/arch/.cache/aurman/pantheon-calen exit:1

rixx commented on 2016-05-27 11:25 (UTC)

Please add a dependency on contractor or contractor-bzr. At the moment, the error mentioned by mareke still happens when you don't have contractor installed: [_LOG_LEVEL_FATAL 10:18:23.978445] ContractorButtonWithMenu.vala:65: GDBus.Error:org.freedesktop.DBus.Error.ServiceUnknown: The name org.elementary.Contractor was not provided by any .service files [_LOG_LEVEL_FATAL 10:18:23.978516] Maya will not function properly.

alucryd commented on 2015-08-15 11:12 (UTC)

I couldn't tell you, I've been getting a black window for a couple months, and now I'm not even getting anything anymore. I have no idea why that is, you might want to try your luck upstream.

mareke commented on 2015-08-15 09:31 (UTC)

Now no fatal errors but startup loading time is same. Does adding Google calendar working? I got Segmentation fault (core dumped) error.

alucryd commented on 2015-08-15 08:09 (UTC)

My bad, I thought this was a build issue, added dep on contractor-bzr.

mareke commented on 2015-08-15 07:20 (UTC)

Strange. Maya startup takes about minute. ** (maya-calendar:23940): WARNING **: Couldn't register with accessibility bus: Did not receive a reply. Possible causes include: the remote application did not send a reply, the message bus security policy blocked the reply, the reply timeout expired, or the network connection was broken. [_LOG_LEVEL_INFO 10:17:23.309389] Application.vala:155: Maya version: 0.3.1.1 [_LOG_LEVEL_INFO 10:17:23.309497] Application.vala:157: Kernel version: 4.1.4-1-ARCH [_LOG_LEVEL_WARN 10:18:23.961070] [GLib-GObject] The property GtkAlignment:top-padding is deprecated and shouldn't be used anymore. It will be removed in a future version. [_LOG_LEVEL_WARN 10:18:23.961331] [GLib-GObject] The property GtkAlignment:right-padding is deprecated and shouldn't be used anymore. It will be removed in a future version. [_LOG_LEVEL_WARN 10:18:23.961512] [GLib-GObject] The property GtkAlignment:bottom-padding is deprecated and shouldn't be used anymore. It will be removed in a future version. [_LOG_LEVEL_WARN 10:18:23.961680] [GLib-GObject] The property GtkAlignment:left-padding is deprecated and shouldn't be used anymore. It will be removed in a future version. [_LOG_LEVEL_FATAL 10:18:23.978445] ContractorButtonWithMenu.vala:65: GDBus.Error:org.freedesktop.DBus.Error.ServiceUnknown: The name org.elementary.Contractor was not provided by any .service files [_LOG_LEVEL_FATAL 10:18:23.978516] Maya will not function properly.

alucryd commented on 2015-08-14 20:14 (UTC)

I don't seem run into this issue. All my packages are built in a clean chroot so there's definitely no contractor package and I can still build maya.

mareke commented on 2015-08-13 20:27 (UTC)

Im getting same error: ContractorButtonWithMenu.vala:65: GDBus.Error:org.freedesktop.DBus.Error.ServiceUnknown: The name org.elementary.Contractor was not provided by any .service files read: https://github.com/pimvullers/elementary/pull/128

alucryd commented on 2015-04-17 08:07 (UTC)

Someone provided me with a patch for evolution 3.16 which is why this now compiles, but I also get a black window even with intel oss driver :(

pauloschilling commented on 2015-04-16 17:43 (UTC)

I also received some errors when I first tried to install it, and when I finally managed to do that, now when I open Maya it takes some time and show just a black screen, probably has something to do with catalyst-test-pxp package, I'm not sure...

gokcen commented on 2015-04-12 20:13 (UTC)

/tmp/xxx/aur-maya-calendar-bzr/src/maya-calendar/core/Model/CalendarModel.vala: In function ‘maya_model_calendar_model_add_source_async_co’: /tmp/xxx/aur-maya-calendar-bzr/src/maya-calendar/core/Model/CalendarModel.vala:365:20: error: too few arguments to function ‘e_cal_client_connect_sync’ var client = new E.CalClient.connect_sync (source, E.CalClientSourceType.EVENTS, cancellable); ^ In file included from /usr/include/evolution-data-server/libecal/libecal.h:28:0, from /tmp/xxx/aur-maya-calendar-bzr/src/maya-calendar/build/core/Model/CalendarModel.c:21: /usr/include/evolution-data-server/libecal/e-cal-client.h:138:11: note: declared here EClient * e_cal_client_connect_sync (ESource *source, ^ core/CMakeFiles/libmaya-calendar.dir/build.make:227: recipe for target 'core/CMakeFiles/libmaya-calendar.dir/Model/CalendarModel.c.o' failed make[2]: *** [core/CMakeFiles/libmaya-calendar.dir/Model/CalendarModel.c.o] Error 1 make[2]: *** Waiting for unfinished jobs.... [

alucryd commented on 2014-03-22 12:21 (UTC)

Which icon are you talking about? Everything looking good here.

ak5 commented on 2014-03-13 08:42 (UTC)

Hi, It seems like I am missing an icon for maya. My other Pantheon (bzr) apps are working fine. Please let me know if this is a known issue.

alucryd commented on 2013-08-30 23:11 (UTC)

roi.dm: Thx for the tip, package updated!

roi.dm commented on 2013-08-29 11:41 (UTC)

using this brach it builds and works fine lp:~tintou/maya/maya-saucy http://pastebay.com/1286724

alucryd commented on 2013-05-10 13:55 (UTC)

This does not build against our version of evolution-data-server. Wait and see for now.

Ner0 commented on 2012-12-26 17:11 (UTC)

Yeah, this is a known problem with evolution-data-server 3.6. https://bugs.launchpad.net/maya/+bug/1088815 The temporary solution is to downgrade it to 3.4.4.

commented on 2012-12-26 05:06 (UTC)

makepkg results in abortion, giving errors to do with evolution-data-server-3.6 libecal. Any ideas on what this is and how i can fix it?

idainet commented on 2012-08-21 19:43 (UTC)

Maya's latest builds use Granite.Widgets.LightWindow which is not available in granite, only granite-bzr

commented on 2012-07-01 19:35 (UTC)

Using 'granite' as a dependency results in a build failure here due to some missing method/object. Using 'granite-bzr' works.

gimmy commented on 2011-11-16 13:56 (UTC)

Please check package with namcap and correct the PKGBUILD: the program gives fatal error at stratup.