Package Details: pantheon-calendar 4.2.3-1

Git Clone URL: https://aur.archlinux.org/pantheon-calendar.git (read-only)
Package Base: pantheon-calendar
Description: The Pantheon Calendar
Upstream URL: https://github.com/elementary/calendar
Licenses: GPL3
Groups: pantheon
Submitter: alucryd
Maintainer: alucryd
Last Packager: alucryd
Votes: 0
Popularity: 0.000000
First Submitted: 2018-01-02 13:16
Last Updated: 2018-10-19 09:18

Latest Comments

alucryd commented on 2018-10-19 09:21

Bumped to the latest version, this one builds fine.

pablo1 commented on 2018-10-18 08:06

The build fails, see error message:

==> Making package: pantheon-calendar 0.4.1-1 (Thu 18 Oct 2018 09:47:21 AM CEST)
==> Checking runtime dependencies...
==> Checking buildtime dependencies...
==> Retrieving sources...
  -> Downloading pantheon-calendar-0.4.1.tar.gz...
  % Total    % Received % Xferd  Average Speed   Time    Time     Time  Current
                                 Dload  Upload   Total   Spent    Left  Speed
100   126    0   126    0     0    226      0 --:--:-- --:--:-- --:--:--   226
100  461k    0  461k    0     0   287k      0 --:--:--  0:00:01 --:--:-- 1003k
==> Validating source files with sha256sums...
    pantheon-calendar-0.4.1.tar.gz ... Passed
==> Extracting sources...
  -> Extracting pantheon-calendar-0.4.1.tar.gz with bsdtar
==> Starting prepare()...
==> Starting build()...
-- The C compiler identification is GNU 8.2.1
-- Check for working C compiler: /usr/bin/cc
-- Check for working C compiler: /usr/bin/cc -- works
-- Detecting C compiler ABI info
-- Detecting C compiler ABI info - done
-- Detecting C compile features
-- Detecting C compile features - done
-- Found PkgConfig: /usr/bin/pkg-config (found version "1.5.3") 
-- Checking for modules 'gobject-2.0;gthread-2.0;glib-2.0;gio-2.0;gee-0.8;gtk+-3.0>=3.11.6;granite>=0.5;libedataserver-1.2;libecal-1.2>=3.8.0;libedataserverui-1.2;libical;gmodule-2.0'
--   Found gobject-2.0, version 2.58.1
--   Found gthread-2.0, version 2.58.1
--   Found glib-2.0, version 2.58.1
--   Found gio-2.0, version 2.58.1
--   Found gee-0.8, version 0.20.1
--   Found gtk+-3.0, version 3.24.1
--   Found granite, version 5.1.0
--   Found libedataserver-1.2, version 3.30.1
--   Found libecal-1.2, version 3.30.1
--   Found libedataserverui-1.2, version 3.30.1
--   Found libical, version 3.0.4
--   Found gmodule-2.0, version 2.58.1
-- Checking for modules 'champlain-gtk-0.12;champlain-0.12;clutter-1.0;geocode-glib-1.0;clutter-gtk-1.0;folks'
--   Found champlain-gtk-0.12, version 0.12.16
--   Found champlain-0.12, version 0.12.16
--   Found clutter-1.0, version 1.26.2
--   Found geocode-glib-1.0, version 3.26.0
--   Found clutter-gtk-1.0, version 1.8.4
--   Found folks, version 0.11.5.20180908
-- Found Vala: /usr/bin/valac  
-- checking for Vala version of 0.23.2
--   found Vala, version 0.42.2
-- libnotify enabled
-- Plugins enabled
-- GSettings schemas will be installed locally.
-- GSettings schemas will be installed into /usr/share/glib-2.0/schemas/
-- Configuring done
-- Generating done
-- Build files have been written to: /tmp/yaourt-tmp-binaryplease/aur-pantheon-calendar/src/build
Scanning dependencies of target i18n
[  0%] Built target i18n
[  1%] Generating /tmp/yaourt-tmp-binaryplease/aur-pantheon-calendar/src/build/core/config.c;Backends/Backend.c;Backends/BackendsManager.c;Backends/LocalBackend.c;Backends/PlacementWidget.c;Model/CalendarModel.c;Settings/MayaSettings.c;Settings/SavedState.c;Settings/LanguagesFormat.c;DateRange.c;Utils.c;GesturesUtils.c;maya-calendar.vapi;maya-calendar.h
/tmp/yaourt-tmp-binaryplease/aur-pantheon-calendar/src/calendar-0.4.1/vapi/posix-extension.vapi:4.2-4.19: error: `Posix' already contains a definition for `NLTime'
    public enum NLTime {
    ^^^^^^^^^^^^^^^^^^
posix.vapi:3356.2-3356.19: note: previous definition of `NLTime' was here
    public enum NLTime {
    ^^^^^^^^^^^^^^^^^^
Compilation failed: 1 error(s), 0 warning(s)
make[2]: *** [core/CMakeFiles/libmaya-calendar.dir/build.make:116: core/libmaya-calendar_valac.stamp] Error 1
make[1]: *** [CMakeFiles/Makefile2:292: core/CMakeFiles/libmaya-calendar.dir/all] Error 2
make: *** [Makefile:130: all] Error 2
==> ERROR: A failure occurred in build().
    Aborting...
==> ERROR: Makepkg was unable to build pantheon-calendar.
==> Restart building pantheon-calendar ? [y/N]
==> ------------------------------------------
==> 

Smile4ever commented on 2018-08-01 19:21

[ 1%] Generating /tmp/yaourt-tmp-geoffrey/aur-pantheon-calendar/src/build/core/config.c;Backends/Backend.c;Backends/BackendsManager.c;Backends/LocalBackend.c;Backends/PlacementWidget.c;Model/CalendarModel.c;Settings/MayaSettings.c;Settings/SavedState.c;Settings/LanguagesFormat.c;DateRange.c;Utils.c;GesturesUtils.c;maya-calendar.vapi;maya-calendar.h /tmp/yaourt-tmp-geoffrey/aur-pantheon-calendar/src/calendar-0.4.1/vapi/posix-extension.vapi:4.2-4.19: error: Posix' already contains a definition forNLTime' public enum NLTime { ^^^^^^^^^^^^^^^^^^ posix.vapi:3081.2-3081.19: note: previous definition of `NLTime' was here public enum NLTime { ^^^^^^^^^^^^^^^^^^ Compilation failed: 1 error(s), 0 warning(s) make[2]: [core/CMakeFiles/libmaya-calendar.dir/build.make:116: core/libmaya-calendar_valac.stamp] Fout 1 make[1]: [CMakeFiles/Makefile2:287: core/CMakeFiles/libmaya-calendar.dir/all] Fout 2 make: *** [Makefile:130: all] Fout 2