Package Details: pantheon-terminal-git 5.5.2.r138.g038bdd26-1

Git Clone URL: https://aur.archlinux.org/pantheon-terminal-git.git (read-only, click to copy)
Package Base: pantheon-terminal-git
Description: The Pantheon Terminal Emulator
Upstream URL: https://github.com/elementary/terminal
Licenses: GPL3
Conflicts: pantheon-terminal
Provides: pantheon-terminal
Submitter: alucryd
Maintainer: SolarAquarion
Last Packager: SolarAquarion
Votes: 32
Popularity: 0.000003
First Submitted: 2017-04-30 15:18 (UTC)
Last Updated: 2021-02-20 23:53 (UTC)

Latest Comments

SolarAquarion commented on 2018-08-21 14:47 (UTC)

you need this "-Dubuntu-bionic-patched-vte=false" now

SolarAquarion commented on 2018-08-21 14:43 (UTC)

The patch isn't needed more afaik

cribbageSTARSHIP commented on 2016-08-09 17:50 (UTC) (edited on 2016-08-09 20:20 (UTC) by cribbageSTARSHIP)

I'm getting a weird Bash prompt from this terminal: bash: PROMPT_COMMAND: line 0: syntax error near unexpected token `;' bash: PROMPT_COMMAND: line 0: `dbus-send --type=method_call --session --dest=org.pantheon.terminal /org/pantheon/terminal org.pantheon.terminal.ProcessFinished string:$PANTHEON_TERMINAL_ID string:"$(history 1 | cut -c 8-)" >/dev/null 2>&1; ; printf "\033]0;%s@%s:%s\007" "${USER}" "${HOSTNAME%%.*}" "${PWD/#$HOME/\~}"' I logged it with the elementaryOS guys to see what they can do. https://bugs.launchpad.net/pantheon-terminal/+bug/1359962 *EDIT* PROMPT_COMMAND="echo -n [$(date +%H%M)]" That got rid of the Garbage

alucryd commented on 2016-01-06 14:55 (UTC)

It works with vte3, in fact pantheon-terminal in [community] is already built against vte3.

wotantx commented on 2016-01-02 03:45 (UTC)

Depends on package vte290, which no longer exists. It builds against vte or vte3, but so far no luck making it run.

d_rail commented on 2015-03-26 05:31 (UTC)

Thanks. Transparency works now and I get to try that fancy search function.

alucryd commented on 2015-03-25 13:18 (UTC)

You can't use trunk because it doesn't work with our vte3 package. However since there is no sign of that branch ever being merged, I switched back to using vte290 instead...

d_rail commented on 2015-03-20 01:39 (UTC)

I marked this out of date. Let me know if it's frozen at: 'pantheon-terminal::bzr+lp:~stevenvandenbrandenstift/pantheon-terminal/fix-1375346' for some reason.

alucryd commented on 2014-02-19 15:09 (UTC)

My pleasure :)

halimbo commented on 2014-02-19 14:59 (UTC)

Works without any errors, thanks a lot.

ciferkey commented on 2012-07-31 18:53 (UTC)

Please update to replace granite with granite-bzr

ciferkey commented on 2012-07-31 18:42 (UTC)

Wouldn't build gave me: [ 12%] Generating src/Settings.c, src/PantheonTerminal.c, src/PantheonTerminalWindow.c, src/TerminalWidget.c, src/ForegroundProcessDialog.c, src/config.c /tmp/yaourt-tmp-ciferkey/aur-pantheon-terminal-bzr/src/pantheon-terminal-build/src/PantheonTerminalWindow.vala:33.16-33.46: error: The type name `Granite.Widgets.DynamicNotebook' could not be found public Granite.Widgets.DynamicNotebook notebook; ^^^^^^^^^^^^^^^^^^^^^^^^^^^^^^^ /tmp/yaourt-tmp-ciferkey/aur-pantheon-terminal-bzr/src/pantheon-terminal-build/src/PantheonTerminalWindow.vala:208.30-208.48: error: The type name `Granite.Widgets.Tab' could not be found private void on_tab_moved (Granite.Widgets.Tab tab, int new_pos, bool new_window, int x, int y) { ^^^^^^^^^^^^^^^^^^^ /tmp/yaourt-tmp-ciferkey/aur-pantheon-terminal-bzr/src/pantheon-terminal-build/src/PantheonTerminalWindow.vala:214.49-214.79: error: The type name `Granite.Widgets.DynamicNotebook' could not be found var n = win.get_children ().nth_data (0) as Granite.Widgets.DynamicNotebook; ^^^^^^^^^^^^^^^^^^^^^^^^^^^^^^^ /tmp/yaourt-tmp-ciferkey/aur-pantheon-terminal-bzr/src/pantheon-terminal-build/src/PantheonTerminalWindow.vala:243.30-243.48: error: The type name `Granite.Widgets.Tab' could not be found void on_switch_page (Granite.Widgets.Tab? old, Granite.Widgets.Tab new_tab) { ^^^^^^^^^^^^^^^^^^^ /tmp/yaourt-tmp-ciferkey/aur-pantheon-terminal-bzr/src/pantheon-terminal-build/src/PantheonTerminalWindow.vala:243.56-243.74: error: The type name `Granite.Widgets.Tab' could not be found void on_switch_page (Granite.Widgets.Tab? old, Granite.Widgets.Tab new_tab) { ^^^^^^^^^^^^^^^^^^^ /tmp/yaourt-tmp-ciferkey/aur-pantheon-terminal-bzr/src/pantheon-terminal-build/src/PantheonTerminalWindow.vala:250.31-250.55: error: The type name `Granite.Widgets.Tab' could not be found private void new_tab (owned Granite.Widgets.Tab? tab=null) { ^^^^^^^^^^^^^^^^^^^^^^^^^ /tmp/yaourt-tmp-ciferkey/aur-pantheon-terminal-bzr/src/pantheon-terminal-build/src/TerminalWidget.vala:29.16-29.34: error: The type name `Granite.Widgets.Tab' could not be found public Granite.Widgets.Tab tab; ^^^^^^^^^^^^^^^^^^^ Compilation failed: 7 error(s), 0 warning(s) make[2]: *** [src/Settings.c] Error 1 make[1]: *** [CMakeFiles/pantheon-terminal.dir/all] Error 2 make: *** [all] Error 2 ==> ERROR: A failure occurred