Package Details: paraview-manta 5.4.0-2

Git Clone URL: https://aur.archlinux.org/paraview-manta.git (read-only)
Package Base: paraview-manta
Description: Parallel Visualization Application using VTK (with MantaView plugin, Qt4, legacy OpenGL)
Upstream URL: http://www.paraview.org
Licenses: custom
Conflicts: paraview
Provides: paraview
Submitter: gucong
Maintainer: gucong
Last Packager: gucong
Votes: 0
Popularity: 0.000000
First Submitted: 2015-09-24 02:46
Last Updated: 2017-07-08 00:03

Latest Comments

eolianoe commented on 2016-04-01 19:55

@rajphys: You need to apply the same ffmpeg patch as in the paraview package [1]

[1] https://aur.archlinux.org/packages/paraview/

rajphys commented on 2016-04-01 05:49

Hi All,

I am getting this error while building. Can you please help me.

/home/raj/software/paraview-manta/src/ParaView-v5.0.0-source/VTK/IO/FFMPEG/vtkFFMPEGWriter.cxx: In member function ‘int vtkFFMPEGWriterInternal::Start()’:
/home/raj/software/paraview-manta/src/ParaView-v5.0.0-source/VTK/IO/FFMPEG/vtkFFMPEGWriter.cxx:194:18: error: ‘PIX_FMT_YUVJ422P’ was not declared in this scope
c->pix_fmt = PIX_FMT_YUVJ422P;
^
/home/raj/software/paraview-manta/src/ParaView-v5.0.0-source/VTK/IO/FFMPEG/vtkFFMPEGWriter.cxx:198:18: error: ‘PIX_FMT_BGR24’ was not declared in this scope
c->pix_fmt = PIX_FMT_BGR24;
^
/home/raj/software/paraview-manta/src/ParaView-v5.0.0-source/VTK/IO/FFMPEG/vtkFFMPEGWriter.cxx:277:40: error: ‘avcodec_alloc_frame’ was not declared in this scope
this->rgbInput = avcodec_alloc_frame();
^
/home/raj/software/paraview-manta/src/ParaView-v5.0.0-source/VTK/IO/FFMPEG/vtkFFMPEGWriter.cxx:283:36: error: ‘PIX_FMT_RGB24’ was not declared in this scope
int RGBsize = avpicture_get_size(PIX_FMT_RGB24, c->width, c->height);
^
/home/raj/software/paraview-manta/src/ParaView-v5.0.0-source/VTK/IO/FFMPEG/vtkFFMPEGWriter.cxx: In member function ‘int vtkFFMPEGWriterInternal::Write(vtkImageData*)’:
/home/raj/software/paraview-manta/src/ParaView-v5.0.0-source/VTK/IO/FFMPEG/vtkFFMPEGWriter.cxx:357:28: error: ‘PIX_FMT_RGB24’ was not declared in this scope
cc->width, cc->height, PIX_FMT_RGB24,
^
VTK/IO/FFMPEG/CMakeFiles/vtkIOFFMPEG.dir/build.make:71: recipe for target 'VTK/IO/FFMPEG/CMakeFiles/vtkIOFFMPEG.dir/vtkFFMPEGWriter.cxx.o' failed
make[2]: *** [VTK/IO/FFMPEG/CMakeFiles/vtkIOFFMPEG.dir/vtkFFMPEGWriter.cxx.o] Error 1
CMakeFiles/Makefile2:7158: recipe for target 'VTK/IO/FFMPEG/CMakeFiles/vtkIOFFMPEG.dir/all' failed
make[1]: *** [VTK/IO/FFMPEG/CMakeFiles/vtkIOFFMPEG.dir/all] Error 2
Makefile:149: recipe for target 'all' failed


Raj