Package Details: passwordsafe-git 3.36.r79.g7401662-1

Git Clone URL: https://aur.archlinux.org/passwordsafe-git.git (read-only)
Package Base: passwordsafe-git
Description: Simple & Secure Password Management
Upstream URL: http://sourceforge.net/projects/passwordsafe/
Keywords: password pwsafe security yubikey
Licenses: Artistic2.0
Conflicts: passwordsafe, passwordsafe-debian, pwsafe
Submitter: trogdor1138
Maintainer: Namarrgon
Last Packager: Namarrgon
Votes: 2
Popularity: 0.000000
First Submitted: 2013-07-12 19:09
Last Updated: 2015-09-23 13:11

Dependencies (9)

Required by (0)

Sources (1)

Latest Comments

Namarrgon commented on 2015-06-08 18:21

To celebrate the AUR-relaunch I changed the pkgver()-scheme. AUR-helpers will see this as a downgrade.

oznah commented on 2014-07-30 15:29

passwordsafe-git 20140518.8848.6fccde3-1

I get an error when program launches. "Could not initialize help subsystem. Help will not be available."

Press "ok" and program launches and appears to work correctly.

EvertVP commented on 2014-01-11 21:13

wxgtk got updated to 3.0 in the packaging system. This verion of passwordsafe isn't compatible with that, it needs wxgtk2.8. Luckily this package is still mantained in the official repositories. I suggest updating the dependencies of this package to depends=('xerces-c' 'wxgtk2.8' 'ykpers')

l0gic commented on 2013-12-26 14:26

ykpers needs to be a normal dependency, since the package won't build without it.
I updated the PKGBUILD accordingly: http://ix.io/9ww

rkelly commented on 2013-12-11 17:18

Getting a failure during makepkg..

Makefile:211: recipe for target 'GCCUnicodeRelease/CompareDlg.o' failed
make[2]: *** [GCCUnicodeRelease/CompareDlg.o] Error 1
make[2]: Leaving directory '/home/richard/Builds/passwordsafe-git/src/passwordsafe-git/src/ui/wxWidgets'
Makefile.linux:37: recipe for target 'unicoderelease' failed
make[1]: *** [unicoderelease] Error 2
make[1]: Leaving directory '/home/richard/Builds/passwordsafe-git/src/passwordsafe-git'
Makefile.linux:46: recipe for target 'release' failed
make: *** [release] Error 2
==> ERROR: A failure occurred in build().
Aborting...

aclindsa commented on 2013-11-22 02:54

trogdor1138: This package does not compile without ykpers installed. It is therefore not 'optional' and should be listed in depends=().

trogdor1138 commented on 2013-11-04 23:42

@Rasi

Is this for integrated usage with a YubiKey? I don't have one, so I can't really test or comment. I've added 'ykpers' as an optional dependency for now.

DaveCode commented on 2013-10-27 05:32

Voted. Discovered via
https://www.schneier.com/blog/archives/2013/09/how_to_remain_s.html
Look at the many awards.
http://passwordsafe.sourceforge.net/downloads.shtml
Thank you for this package.

DaveCode commented on 2013-10-27 05:30

Voted. Discovered via [url=https://www.schneier.com/blog/archives/2013/09/how_to_remain_s.html]Bruce himself[/url]. Look at the many [url=http://passwordsafe.sourceforge.net/downloads.shtml]awards[/url]. Thank you for this package.

Rasi commented on 2013-09-09 17:56

fixed PKGBUILD to include ykpers as dependency. also added a patch that fixes the Makefile to search in /usr instead /usr/local
http://53280.de/passwordsafe-git-20130712-1.src.tar.gz

compiles fine now.