Package Details: pcmanx-gtk2-git 717.ad0af3a-1

Git Clone URL: https://aur.archlinux.org/pcmanx-gtk2-git.git (read-only, click to copy)
Package Base: pcmanx-gtk2-git
Description: A gtk+ based free BBS client
Upstream URL: http://code.google.com/p/pcmanx-gtk2
Keywords: network
Licenses: GPL
Conflicts: pcmanx-gtk2
Provides: pcmanx-gtk2
Submitter: dreamcwli
Maintainer: aitjcize
Last Packager: aitjcize
Votes: 9
Popularity: 0.000000
First Submitted: 2012-09-10 10:31
Last Updated: 2016-02-16 17:01

Latest Comments

« First ‹ Previous 1 2

realturner commented on 2010-07-12 07:52

adding the following parameters in ./configure should resolve this problem:
--enable-static --disable-shared

realturner commented on 2010-07-12 07:52

adding the following parameters in ./configure should resolve this problem:
--enable-static --disable-shared

Anonymous comment on 2010-06-11 09:30

appconfig.o: In function `CAppConfig::LoadFavorites()':
appconfig.cpp:(.text+0x122e): undefined reference to `CSite::SetPasswd(std::basic_string<char, std::char_traits<char>, std::allocator<char> >)'
appconfig.cpp:(.text+0x17d3): undefined reference to `CSite::SetPasswdPrompt(std::basic_string<char, std::char_traits<char>, std::allocator<char> >)'
appconfig.cpp:(.text+0x180b): undefined reference to `CSite::SetLoginPrompt(std::basic_string<char, std::char_traits<char>, std::allocator<char> >)'
appconfig.cpp:(.text+0x1840): undefined reference to `CSite::SetPostLogin(std::basic_string<char, std::char_traits<char>, std::allocator<char> >)'
appconfig.cpp:(.text+0x1875): undefined reference to `CSite::SetPreLogin(std::basic_string<char, std::char_traits<char>, std::allocator<char> >)'
appconfig.cpp:(.text+0x1928): undefined reference to `CSite::SetLogin(std::basic_string<char, std::char_traits<char>, std::allocator<char> >)'
collect2: ld returned 1 exit status
make[3]: *** [pcmanx] Error 1
make[3]: Leaving directory `/tmp/yaourt-tmp-cjh/aur-pcmanx-gtk2-svn/src/pcmanx-gtk2-build/src'
make[2]: *** [all-recursive] Error 1
make[2]: Leaving directory `/tmp/yaourt-tmp-cjh/aur-pcmanx-gtk2-svn/src/pcmanx-gtk2-build/src'
make[1]: *** [all-recursive] Error 1
make[1]: Leaving directory `/tmp/yaourt-tmp-cjh/aur-pcmanx-gtk2-svn/src/pcmanx-gtk2-build'
make: *** [all] Error 2
==> ERROR: Build Failed.
Aborting...
==> ERROR: Makepkg was unable to build pcmanx-gtk2-svn.
svn跟非svn版本都編譯失敗

另外PKGBUILD的
makedepends=('autoconf automake')
請修改成
makedepends=('autoconf' 'automake')
不然他每次都要求重新安裝這兩個程式
非svn版本亦同