Package Details: perl-bareword-filehandles 0.005-2

Git Clone URL: https://aur.archlinux.org/perl-bareword-filehandles.git (read-only)
Package Base: perl-bareword-filehandles
Description: disables bareword filehandles
Upstream URL: https://metacpan.org/release/bareword-filehandles
Licenses: GPL, PerlArtistic
Submitter: None
Maintainer: nirnakinho
Last Packager: nirnakinho
Votes: 6
Popularity: 0.025037
First Submitted: 2013-07-12 11:09
Last Updated: 2017-09-30 13:08

Latest Comments

nirnakinho commented on 2017-10-07 20:11

I'm afraid I cannot reproduce the test failures. Additionally, I built the package in a chroot, but did not see any errors, either.

Due to the recent perl library path change, you might need to re-install a few perl modules. Please check www.archlinux.org for directions.

aaronfischer commented on 2017-10-07 15:05

Test Summary Report
-------------------
t/basic.t (Wstat: 18432 Tests: 480 Failed: 72)
Failed tests: 1-2, 9, 16, 23, 30, 37, 44, 51, 58, 65
72, 79, 86, 93, 100, 107, 114, 121, 128
135, 142, 149, 156, 163, 170, 177, 184
191, 198, 205, 212, 219, 226, 233, 240
247, 254, 261, 268, 275, 282, 289, 296
303, 310, 317, 324, 331, 338, 345, 352
359, 366, 373, 380, 387, 394, 401, 408
415, 422, 429, 436, 443, 450, 457, 464
471, 478-480
Non-zero exit status: 72
Files=2, Tests=481, 1 wallclock secs ( 0.08 usr 0.01 sys + 0.57 cusr 0.06 csys = 0.72 CPU)
Result: FAIL
Failed 1/2 test programs. 72/481 subtests failed.
make: *** [Makefile:1045: test_dynamic] Error 72

tony_42 commented on 2017-09-28 14:58

Hi,

There the makedependency perl-extutils-depends missing.

Thanks.

oneeyed commented on 2017-07-17 16:24

cc -c -I/usr/lib/perl5/vendor_perl/B/Hooks/OP/Check/Install -D_REENTRANT -D_GNU_SOURCE -fwrapv -fno-strict-aliasing -pipe -fstack-protector-strong -I/usr/local/include -D_LARGEFILE_SOURCE -D_FILE_OFFSET_BITS=64 -march=x86-64 -mtune=generic -O2 -pipe -fstack-protector-strong -DVERSION=\"0.003\" -DXS_VERSION=\"0.003\" -fPIC "-I/usr/lib/perl5/core_perl/CORE" filehandles.c
filehandles.xs: In function ‘bareword_filehandles_list_check_op’:
filehandles.xs:88:38: error: ‘OP {aka struct op}’ has no member named ‘op_sibling’; did you mean ‘op_sibparent’?
while(num_args-- && (child = child->op_sibling))
^~~~~~~~~~
op_sibparent
make: *** [Makefile:337: filehandles.o] Error 1

jnbek commented on 2015-05-29 21:35

uhh, there's no t/basic.t test in this module?

oldmanmike commented on 2015-05-29 21:06

Seems to be failing a lot of tests for me:

Test Summary Report
-------------------
t/basic.t (Wstat: 18432 Tests: 480 Failed: 72)
Failed tests: 1-2, 9, 16, 23, 30, 37, 44, 51, 58, 65
72, 79, 86, 93, 100, 107, 114, 121, 128
135, 142, 149, 156, 163, 170, 177, 184
191, 198, 205, 212, 219, 226, 233, 240
247, 254, 261, 268, 275, 282, 289, 296
303, 310, 317, 324, 331, 338, 345, 352
359, 366, 373, 380, 387, 394, 401, 408
415, 422, 429, 436, 443, 450, 457, 464
471, 478-480
Non-zero exit status: 72
Files=3, Tests=480, 0 wallclock secs ( 0.08 usr 0.00 sys + 0.14 cusr 0.00 csys = 0.22 CPU)
Result: FAIL
Failed 1/3 test programs. 72/480 subtests failed.
Makefile:1012: recipe for target 'test_dynamic' failed
make: *** [test_dynamic] Error 72