Package Details: photohawk-git 0.0.2.r29.gcc219b7-1

Git Clone URL: https://aur.archlinux.org/photohawk-git.git (read-only)
Package Base: photohawk-git
Description: Java image comparison for SSIM, AE, MAE, MSE, PAE, Equals
Upstream URL: http://datascience.github.io/photohawk/
Licenses: Apache
Conflicts: photohawk
Provides: photohawk
Submitter: mksplg
Maintainer: mksplg
Last Packager: mksplg
Votes: 0
Popularity: 0.000000
First Submitted: 2015-08-10 09:22
Last Updated: 2015-08-10 10:24

Latest Comments

trougnouf commented on 2019-10-18 09:58

I get a compilation error:

[...]

Downloaded from central: https://repo.maven.apache.org/maven2/org/codehaus/plexus/plexus-compiler-api/1.8.1/plexus-compiler-api-1.8.1.jar (20 kB at 798 kB/s)

Downloaded from central: https://repo.maven.apache.org/maven2/org/codehaus/plexus/plexus-compiler-javac/1.8.1/plexus-compiler-javac-1.8.1.jar (13 kB at 501 kB/s)

[WARNING] File encoding has not been set, using platform encoding UTF-8, i.e. build is platform dependent!

[INFO] Compiling 43 source files to /home/trougnouf/.cache/pacaur/photohawk-git/src/photohawk/photohawk-image-evaluator/target/classes

[INFO] -------------------------------------------------------------

[ERROR] COMPILATION ERROR :

[INFO] -------------------------------------------------------------

[ERROR] error: Source option 6 is no longer supported. Use 7 or later.

[ERROR] error: Target option 6 is no longer supported. Use 7 or later.

[INFO] 2 errors

[INFO] -------------------------------------------------------------

[INFO] ------------------------------------------------------------------------

[INFO] Reactor Summary for Photohawk 0.0.3-SNAPSHOT:

[INFO]

[INFO] Photohawk .......................................... SUCCESS [ 0.238 s]

[INFO] Photohawk image evaluator .......................... FAILURE [ 3.141 s]

[INFO] Photohawk commandline .............................. SKIPPED

[INFO] ------------------------------------------------------------------------

[INFO] BUILD FAILURE

[INFO] ------------------------------------------------------------------------

[INFO] Total time: 15.284 s

[INFO] Finished at: 2019-10-18T11:57:14+02:00

[INFO] ------------------------------------------------------------------------

[ERROR] Failed to execute goal org.apache.maven.plugins:maven-compiler-plugin:2.3.2:compile (default-compile) on project photohawk-image-evaluator: Compilation failure: Compilation failure:

[ERROR] error: Source option 6 is no longer supported. Use 7 or later.

[ERROR] error: Target option 6 is no longer supported. Use 7 or later.

[ERROR] -> [Help 1]

[ERROR]

[ERROR] To see the full stack trace of the errors, re-run Maven with the -e switch.

[ERROR] Re-run Maven using the -X switch to enable full debug logging.

[ERROR]

[ERROR] For more information about the errors and possible solutions, please read the following articles:

[ERROR] [Help 1] http://cwiki.apache.org/confluence/display/MAVEN/MojoFailureException

[ERROR]

[ERROR] After correcting the problems, you can resume the build with the command

[ERROR] mvn <args> -rf :photohawk-image-evaluator

==> ERROR: A failure occurred in build().

Aborting...

:: dcraw is now an orphan package

:: maven is now an orphan package

:: ruby-ronn is now an orphan package

:: failed to build photohawk-git package(s)